{"text_format":"3","workbook":"xlsx","n_sheets":5,"sheets":["MANUAL","Producao","Comercializacao","OBSERVACAO","LISTAS"],"not_rendered":{"macros":1,"defined_names":58},"read":"whole","date_system":"1900"}

{"sheet":"MANUAL","index":0,"n_rows":29,"n_cols":3,"rows_kept":29,"merged":[[0,1,0,3]]}
[]
[]
[null,null,"Manual de Orientação para o preenchimento do formulário. Por favor,\nleia-a atentamente antes de iniciar o preenchimento. Bom trabalho! "]
[]
[null,null,"ANTES DE INICIAR, TRÊS AVISOS IMPORTANTES:  "]
[null,null,"1. As Tabelas de Sistematização do Cadastro do Empreendimento funcionam no Microsoft Excel, nas versões 2007 e mais atuais. Os programas OpenOffice, BrOffice e afins não são recomendados. "]
[null,null,"2. A fim de permitir uso correto dos botões de inserção de linhas as macros devem se habilitadas, sempre."]
[null,null,"3. As Tabelas já estão formatadas para impressão, de forma a facilitar o levantamento das informações com o formulário em papel. Algumas explicações que aparecem ao lado não se encontram nesta impressão."]
[]
[null,null,"AS TABELAS TÊM A SEGUINTE CODIFICAÇÃO:"]
[null,null,"As células para entrada de informação são somente as que têm fundo AMARELO, BRANCO ou VERDE:"]
[null,null,"As Células em AMARELO são com entrada restrita somente a número, cuja formatação já está embutida de forma que não é necessário colocar '/', '-', '.' ou outro caracter se não a vírgula para separação de decimais. Assim digitar somente os números uma vez que os formatos sairão de modo automático (ex. CNPJ com o tipo 00.000.000/0000-00, CPF 000.000.000-00, CEP 00.000-000, telefone (00) 0000-0000 fixo ou (00) 0.0000-0000 celular, divisão de milhar, casas decimais, percentuais);"]
[null,null,"As Células em VERDE são com entrada restrita a uma lista, conforme a informação necessária;"]
[null,null,"As Células em BRANCO são com entrada livre, ou seja, admite qualque caractér, conforme o caso."]
[null,null,"A Tabela OBSERVACAO admite a Inserção de mais Linhas bastando para tanto Acionar o Botão INSERIR LINHAS."]
[]
[null,null,"As Tabelas são Protegidas para evitar desconfigurações. Não altere, copie ou cole qualquer uma delas em outro arquivo para fins de preenchimento. Em caso de dúvidas e problemas entre em contato."]
[null,null," E-mail: chavesmoacir@gmail.com"]
[]
[null,null,"ORIENTAÇÃO PARA O PREENCHIMENTO"]
[null,null,"Este Tutorial de Orientação apresenta as questões pertinentes ao formulário de cadastro do Empreendimento com o propósito de detalhar algumas das informações que serão levantadas."]
[null,null,"De início, é importante pontuar que um bom trabalho de levantamento não é feito somente na dinâmica de entrevista, com perguntas diretas às pessoas que estão sendo visitadas e entrevistadas e anotando as respostas “secas” a cada pergunta. É essencial a observação direta dos técnicos durante o diálogo com os entrevistados para que se cheguem às informações pretendidas."]
[null,null,"O papel da ANATER não é a de fiscal, assim não cabe a ela verificar a veracidade de cada questão. As informações aqui sistematizadas têm o objetivo de constituir o mínimo que se julgou pertinente entre a ANATER e a SEAD para embasar o trabalho da equipe técnica, ampliar a percepção do empreendimento sobre o que deve ser gerenciado e conhecer a realidade da organização socioeconômica da agricultura familiar."]
[]
[null,null,"DESCRIÇÃO DAS TABELAS"]
[null,null,"A Tabela “MANUAL” traz informações sobre o formulário de sistematização."]
[null,null,"A Tabela “OBSERVACAO” serve para o registro de observações para melhor entendimento das informações sistematizadas nas demais."]
[null,null,"Na Tabela “PRODUCAO” são levantadas informações sobre os produtos que o Empreendimento comercializa e/ou produz. É um dos quadros mais complexos no preenchimento. Cada linha significa o conjunto de informações pertinentes a um tipo de produto (gênero). Um mesmo gênero deve constar em linhas distintas se informações sobre seu tipo de produção (da sociobiodiversidade, agroecológico, orgânico, convencional ou transgênico) ou unidade forem diferentes. A lista de gêneros é aberta a qualquer digitação, assim vale lembrar que o complemento “orgânico” ou outro atributo não deva constar no nome, mas assinalado no campo específico quando oportuno. O mesmo vale para marca ou nome comercial que deve ser omitido."]
[null,null,"Na Tabela “COMERCIALIZACAO” são levantadas informações sobre o faturamento global e estratificado do Empreendimento por segmentos de mercado, bem como a abrangência geográfica de comercialização. O valor total do mercado privado (convencional) é a soma do consolidado no varejo, com os valores do atacado e da exportação, sendo que o valor do varejo é a soma dos valores distribuídos em feiras, varejo local, supermercado, loja própria e outros. O mesmo raciocínio vale para o mercado institucional, o qual é segmentado em PAA, PNAE, Biodiesel, Programas Estaduais e outros, sendo que o PAA ainda é segmentado em Doação Simultânea CONAB e Estados/Prefeituras, Formação de Estoque, Leite e Institucional. Quanto à abrangência geográfica está bem clara cada opção, sendo que no caso dos totais a regra é somar a abrangência dos correlatos (ex. se a venda para supermercado é em âmbito estadual, não incluindo o município sede do Empreendimento, mas a feira é exclusiva no município a área de venda do varejo é município mais estado). Ainda são sistematizadas informações sobre a emissão de documentos fiscais de comercialização, e quem é o responsável comercial."]

{"sheet":"Producao","index":1,"n_rows":1037,"n_cols":17,"rows_kept":1037,"merged":[[0,1,0,17],[2,3,2,16],[3,3,3,16],[24,2,24,16],[25,2,25,16],[26,2,26,16],[27,2,27,16],[28,2,28,16],[29,2,29,16],[30,2,30,16],[31,2,31,16],[32,2,32,16],[33,2,33,16],[34,2,34,16],[35,2,35,16]]}
[null,"LEIA O MANUAL E AS EXPLICAÇÕES ABAIXO PARA CORRETO USO DA TABELA"]
[]
[null,null,"5.0","LEVANTAMENTO DOS PRODUTOS COMERCIALIZADOS PELO EMPREENDIMENTO"]
[{"$nulls":3},"para a estimativa de produção considerar média dos últimos 3 anos e para as quantidades comercializadas considerar a soma do último ano civil"]
[null,null,"N","PRODUTO","EMBALAGEM\nPRIMÁRIA","PESO ou\nVolume da\nUnidade","UNIDADE \nde Medida","ESTIMATIVA \nPotencial de \nProdução","QUANTIDADE \nComercializada \nPAA","QUANTIDADE \nComercializada \nPNAE","QUANTIDADE \nComercializada \nBIODIESEL","QUANTIDADE \nComercializada \nMercado Privado","QUANTIDADE \nComercializada \nOUTROS Canais","QUANTIDADE  Comercializada TOTAL","Taxa % de Ocupação\n(com/prod)","TIPO DE \nPRODUTO"," IN NATURA \nBENEFICIADO \nPROCESSADO"]
[null,null,{"$f":"ROW(A6)-5","v":{"v":1,"d":"5.01"}},{"$nulls":10},{"$f":"SUM(I6:M6)","v":{"v":0,"d":"0.0"}},{"$f":"IF(H6=0,\"SR\",N6/H6)","v":"SR"}]
[null,null,{"$f":"ROW(A7)-5","v":{"v":2,"d":"5.02"}},{"$nulls":10},{"v":0,"d":"0.0"},{"$f":"IF(H7=0,\"SR\",N7/H7)","v":"SR"}]
[null,null,{"v":3,"d":"5.03"},{"$nulls":10},{"v":0,"d":"0.0"},"SR"]
[null,null,{"v":4,"d":"5.04"},{"$nulls":10},{"v":0,"d":"0.0"},"SR"]
[null,null,{"v":5,"d":"5.05"},{"$nulls":10},{"v":0,"d":"0.0"},"SR"]
[null,null,{"$f":"ROW(A11)-5","v":{"v":6,"d":"5.06"}},{"$nulls":10},{"v":0,"d":"0.0"},"SR"]
[null,null,{"v":7,"d":"5.07"},{"$nulls":10},{"v":0,"d":"0.0"},"SR"]
[null,null,{"v":8,"d":"5.08"},{"$nulls":10},{"v":0,"d":"0.0"},"SR"]
[null,null,{"v":9,"d":"5.09"},{"$nulls":10},{"v":0,"d":"0.0"},"SR"]
[null,null,{"v":10,"d":"5.10"},{"$nulls":10},{"v":0,"d":"0.0"},"SR"]
[null,null,{"$f":"ROW(A16)-5","v":{"v":11,"d":"5.11"}},{"$nulls":10},{"v":0,"d":"0.0"},"SR"]
[null,null,{"$f":"ROW(A17)-5","v":{"v":12,"d":"5.12"}},{"$nulls":10},{"v":0,"d":"0.0"},"SR"]
[null,null,{"$f":"ROW(A18)-5","v":{"v":13,"d":"5.13"}},{"$nulls":10},{"v":0,"d":"0.0"},"SR"]
[null,null,{"v":14,"d":"5.14"},{"$nulls":10},{"v":0,"d":"0.0"},"SR"]
[null,null,{"$f":"ROW(A20)-5","v":{"v":15,"d":"5.15"}},{"$nulls":10},{"$f":"SUM(I20:M20)","v":{"v":0,"d":"0.0"}},"SR"]
[null,null,{"$f":"ROW(A21)-5","v":{"v":16,"d":"5.16"}},{"$nulls":10},{"$f":"SUM(I21:M21)","v":{"v":0,"d":"0.0"}},{"$f":"IF(H21=0,\"SR\",N21/H21)","v":"SR"}]
[null,null,{"$f":"ROW(A22)-5","v":{"v":17,"d":"5.17"}},{"$nulls":10},{"$f":"SUM(I22:M22)","v":{"v":0,"d":"0.0"}},{"$f":"IF(H22=0,\"SR\",N22/H22)","v":"SR"}]
[null,null,{"$f":"ROW(A23)-5","v":{"v":18,"d":"5.18"}},{"$nulls":10},{"$f":"SUM(I23:M23)","v":{"v":0,"d":"0.0"}},{"$f":"IF(H23=0,\"SR\",N23/H23)","v":"SR"}]
[null,"##","X","X","UNIDADEmedida",{"$nulls":10},"TIPOproduto"]
[null,null,"considerar como produto comercializado qualquer gênero (produto acabado e/ou matéria-prima) produzido e/ou comercializado em nome do empreendimento. O ideal é que que cada diferenciação do gênero em relação à embalagem, peso, unidade e tipo configure um produto diferente. Ex. orgânico e convencional são produtos diferentes, pacotes de 100g e de 1kg também são produtos distintos, assim como pote de vidro e pote de plástico."]
[null,null,"EMBALAGEM PRIMÁRIA: é a embalagem que contém o produto (ex. polpa de fruta em pacote de 100 g: a EMBALAGEM é pacote). Selecionar conforme lista e no caso de outro, especificar na tabela OBSERVACAO."]
[null,null,"PESO ou Volume da Unidade: corresponde ao valor da quantidade de produto presente na embalagem (ex. polpa de fruta em pacote de 100 g: o PESO é 100). Tem precisão de até 3 casas decimais."]
[null,null,"UNIDADE DE MEDIDA: é a unidade que identifica a quantidade da embalagem (ex. polpa de fruta em pacote de 100 g: a UNIDADE é g, de grama). Selecionar conforme lista."]
[null,null,"Potencial de Produção: indica o valor da capacidade máxima de produção do item (produto), indicando o potencial que pode ser comercializado."]
[null,null,"QUANTIDADE COMERCIALIZADA: indica o valor da unidade de medida que foi comercializada no último ano civil, confome o segmento de mercado."]
[null,null,"TIPO DE PRODUTO: conforme lista indica se o produto é da sociobiodiversidade, agroecológico, orgânico (considerar apenas se certificado), convencional ou transgênico. Caso exista o mesmo produto com tipos diferentes registrar em linhas diferentes o mesmo gênero para cada tipo de produto com as devidas notações nos demais campos."]
[null,null,"BENEFICIADO PROCESSADO: conforme lista indica se o produto é in natura, classificado, beneficiado ou processado."]
[null,null,"In Natura: todo produto que saiu da colheita para a comercialização sem sofrer qualquer tipo de manuseio além do embalo, transporte, armazenamento e distribuição."]
[null,null,"Classificado: todo produto IN NATURA que da colheita à comercialização apenas sofreu seleção para padronização de cor, tamanho, forma, peso..."]
[null,null,"Beneficiado: todo produto IN NATURA que da colheita à comercialização sofreu qualquer tipo de intervenção após sua colheita, conferindo valor adicional, mas sem alterar as características do mesmo, a ex. da limpeza, descascamento, minimamente processado..."]
[null,null,"Processado: todo produto que da colheita à comercialização sofreu algum tipo de processo que alterou suas características originais, como doces, fermentados, embutidos..."]
[null,null,"X","X","UNIDADEmedida",{"$nulls":10},"TIPOproduto"]
[null,null,"X","X","kg",{"$nulls":10},"SocioBiodiversidade"]
[null,null,"X","X","ton",{"$nulls":10},"Agroecológico"]
[null,null,"X","X","litro",{"$nulls":10},"Orgânico"]
[null,null,"X","X","m³",{"$nulls":10},"Convencional"]
[null,null,"X","X","unidade",{"$nulls":10},"Transgênico"]
[null,null,"X","X","dúzia"]
[null,null,"X","X"]
[null,null,"X","X"]
[null,null,"X","X"]
[null,null,"X","X"]
[null,null,"X","X"]
[null,null,"X","X"]
[null,null,"X","X"]
[null,null,"X","X"]
[null,null,"X","X"]
[null,null,"X","X"]
[null,null,"X","X"]
[null,null,"X","X"]
[null,null,"X","X"]
[null,null,"X","X"]
[null,null,"X","X"]
[null,null,"X","X"]
[null,null,"X","X"]
[null,null,"X","X"]
[null,null,"X","X"]
[null,null,"X","X"]
[null,null,"X","X"]
[null,null,"X","X"]
[null,null,"X","X"]
[null,null,"X","X"]
[null,null,"X","X"]
[null,null,"X","X"]
[null,null,"X","X"]
[null,null,"X","X"]
[null,null,"X","X"]
[null,null,"X","X"]
[null,null,"X","X"]
[null,null,"X","X"]
[null,null,"X","X"]
[null,null,"X","X"]
[null,null,"X","X"]
[null,null,"X","X"]
[null,null,"X","X"]
[null,null,"X","X"]
[null,null,"X","X"]
[null,null,"X","X"]
[null,null,"X","X"]
[null,null,"X","X"]
[null,null,"X","X"]
[null,null,"X","X"]
[null,null,"X","X"]
[null,null,"X","X"]
[null,null,"X","X"]
[null,null,"X","X"]
[null,null,"X","X"]
[null,null,"X","X"]
[null,null,"X","X"]
[null,null,"X","X"]
[null,null,"X","X"]
[null,null,"X","X"]
[null,null,"X","X"]
[null,null,"X","X"]
[null,null,"X","X"]
[null,null,"X","X"]
[null,null,"X","X"]
[null,null,"X","X"]
[null,null,"X","X"]
[null,null,"X","X"]
[null,null,"X","X"]
[null,null,"X","X"]
[null,null,"X","X"]
[null,null,"X","X"]
[null,null,"X","X"]
[null,null,"X","X"]
[null,null,"X","X"]
[null,null,"X","X"]
[null,null,"X","X"]
[null,null,"X","X"]
[null,null,"X","X"]
[null,null,"X","X"]
[null,null,"X","X"]
[null,null,"X","X"]
[null,null,"X","X"]
[null,null,"X","X"]
[null,null,"X","X"]
[null,null,"X","X"]
[null,null,"X","X"]
[null,null,"X","X"]
[null,null,"X","X"]
[null,null,"X","X"]
[null,null,"X","X"]
[null,null,"X","X"]
[null,null,"X","X"]
[null,null,"X","X"]
[null,null,"X","X"]
[null,null,"X","X"]
[null,null,"X","X"]
[null,null,"X","X"]
[null,null,"X","X"]
[null,null,"X","X"]
[null,null,"X","X"]
[null,null,"X","X"]
[null,null,"X","X"]
[null,null,"X","X"]
[null,null,"X","X"]
[null,null,"X","X"]
[null,null,"X","X"]
[null,null,"X","X"]
[null,null,"X","X"]
[null,null,"X","X"]
[null,null,"X","X"]
[null,null,"X","X"]
[null,null,"X","X"]
[null,null,"X","X"]
[null,null,"X","X"]
[null,null,"X","X"]
[null,null,"X","X"]
[null,null,"X","X"]
[null,null,"X","X"]
[null,null,"X","X"]
[null,null,"X","X"]
[null,null,"X","X"]
[null,null,"X","X"]
[null,null,"X","X"]
[null,null,"X","X"]
[null,null,"X","X"]
[null,null,"X","X"]
[null,null,"X","X"]
[null,null,"X","X"]
[null,null,"X","X"]
[null,null,"X","X"]
[null,null,"X","X"]
[null,null,"X","X"]
[null,null,"X","X"]
[null,null,"X","X"]
[null,null,"X","X"]
[null,null,"X","X"]
[null,null,"X","X"]
[null,null,"X","X"]
[null,null,"X","X"]
[null,null,"X","X"]
[null,null,"X","X"]
[null,null,"X","X"]
[null,null,"X","X"]
[null,null,"X","X"]
[null,null,"X","X"]
[null,null,"X","X"]
[null,null,"X","X"]
[null,null,"X","X"]
[null,null,"X","X"]
[null,null,"X","X"]
[null,null,"X","X"]
[null,null,"X","X"]
[null,null,"X","X"]
[null,null,"X","X"]
[null,null,"X","X"]
[null,null,"X","X"]
[null,null,"X","X"]
[null,null,"X","X"]
[null,null,"X","X"]
[null,null,"X","X"]
[null,null,"X","X"]
[null,null,"X","X"]
[null,null,"X","X"]
[null,null,"X","X"]
[null,null,"X","X"]
[null,null,"X","X"]
[null,null,"X","X"]
[null,null,"X","X"]
[null,null,"X","X"]
[null,null,"X","X"]
[null,null,"X","X"]
[null,null,"X","X"]
[null,null,"X","X"]
[null,null,"X","X"]
[null,null,"X","X"]
[null,null,"X","X"]
[null,null,"X","X"]
[null,null,"X","X"]
[null,null,"X","X"]
[null,null,"X","X"]
[null,null,"X","X"]
[null,null,"X","X"]
[null,null,"X","X"]
[null,null,"X","X"]
[null,null,"X","X"]
[null,null,"X","X"]
[null,null,"X","X"]
[null,null,"X","X"]
[null,null,"X","X"]
[null,null,"X","X"]
[null,null,"X","X"]
[null,null,"X","X"]
[null,null,"X","X"]
[null,null,"X","X"]
[null,null,"X","X"]
[null,null,"X","X"]
[null,null,"X","X"]
[null,null,"X","X"]
[null,null,"X","X"]
[null,null,"X","X"]
[null,null,"X","X"]
[null,null,"X","X"]
[null,null,"X","X"]
[null,null,"X","X"]
[null,null,"X","X"]
[null,null,"X","X"]
[null,null,"X","X"]
[null,null,"X","X"]
[null,null,"X","X"]
[null,null,"X","X"]
[null,null,"X","X"]
[null,null,"X","X"]
[null,null,"X","X"]
[null,null,"X","X"]
[null,null,"X","X"]
[null,null,"X","X"]
[null,null,"X","X"]
[null,null,"X","X"]
[null,null,"X","X"]
[null,null,"X","X"]
[null,null,"X","X"]
[null,null,"X","X"]
[null,null,"X","X"]
[null,null,"X","X"]
[null,null,"X","X"]
[null,null,"X","X"]
[null,null,"X","X"]
[null,null,"X","X"]
[null,null,"X","X"]
[null,null,"X","X"]
[null,null,"X","X"]
[null,null,"X","X"]
[null,null,"X","X"]
[null,null,"X","X"]
[null,null,"X","X"]
[null,null,"X","X"]
[null,null,"X","X"]
[null,null,"X","X"]
[null,null,"X","X"]
[null,null,"X","X"]
[null,null,"X","X"]
[null,null,"X","X"]
[null,null,"X","X"]
[null,null,"X","X"]
[null,null,"X","X"]
[null,null,"X","X"]
[null,null,"X","X"]
[null,null,"X","X"]
[null,null,"X","X"]
[null,null,"X","X"]
[null,null,"X","X"]
[null,null,"X","X"]
[null,null,"X","X"]
[null,null,"X","X"]
[null,null,"X","X"]
[null,null,"X","X"]
[null,null,"X","X"]
[null,null,"X","X"]
[null,null,"X","X"]
[null,null,"X","X"]
[null,null,"X","X"]
[null,null,"X","X"]
[null,null,"X","X"]
[null,null,"X","X"]
[null,null,"X","X"]
[null,null,"X","X"]
[null,null,"X","X"]
[null,null,"X","X"]
[null,null,"X","X"]
[null,null,"X","X"]
[null,null,"X","X"]
[null,null,"X","X"]
[null,null,"X","X"]
[null,null,"X","X"]
[null,null,"X","X"]
[null,null,"X","X"]
[null,null,"X","X"]
[null,null,"X","X"]
[null,null,"X","X"]
[null,null,"X","X"]
[null,null,"X","X"]
[null,null,"X","X"]
[null,null,"X","X"]
[null,null,"X","X"]
[null,null,"X","X"]
[null,null,"X","X"]
[null,null,"X","X"]
[null,null,"X","X"]
[null,null,"X","X"]
[null,null,"X","X"]
[null,null,"X","X"]
[null,null,"X","X"]
[null,null,"X","X"]
[null,null,"X","X"]
[null,null,"X","X"]
[null,null,"X","X"]
[null,null,"X","X"]
[null,null,"X","X"]
[null,null,"X","X"]
[null,null,"X","X"]
[null,null,"X","X"]
[null,null,"X","X"]
[null,null,"X","X"]
[null,null,"X","X"]
[null,null,"X","X"]
[null,null,"X","X"]
[null,null,"X","X"]
[null,null,"X","X"]
[null,null,"X","X"]
[null,null,"X","X"]
[null,null,"X","X"]
[null,null,"X","X"]
[null,null,"X","X"]
[null,null,"X","X"]
[null,null,"X","X"]
[null,null,"X","X"]
[null,null,"X","X"]
[null,null,"X","X"]
[null,null,"X","X"]
[null,null,"X","X"]
[null,null,"X","X"]
[null,null,"X","X"]
[null,null,"X","X"]
[null,null,"X","X"]
[null,null,"X","X"]
[null,null,"X","X"]
[null,null,"X","X"]
[null,null,"X","X"]
[null,null,"X","X"]
[null,null,"X","X"]
[null,null,"X","X"]
[null,null,"X","X"]
[null,null,"X","X"]
[null,null,"X","X"]
[null,null,"X","X"]
[null,null,"X","X"]
[null,null,"X","X"]
[null,null,"X","X"]
[null,null,"X","X"]
[null,null,"X","X"]
[null,null,"X","X"]
[null,null,"X","X"]
[null,null,"X","X"]
[null,null,"X","X"]
[null,null,"X","X"]
[null,null,"X","X"]
[null,null,"X","X"]
[null,null,"X","X"]
[null,null,"X","X"]
[null,null,"X","X"]
[null,null,"X","X"]
[null,null,"X","X"]
[null,null,"X","X"]
[null,null,"X","X"]
[null,null,"X","X"]
[null,null,"X","X"]
[null,null,"X","X"]
[null,null,"X","X"]
[null,null,"X","X"]
[null,null,"X","X"]
[null,null,"X","X"]
[null,null,"X","X"]
[null,null,"X","X"]
[null,null,"X","X"]
[null,null,"X","X"]
[null,null,"X","X"]
[null,null,"X","X"]
[null,null,"X","X"]
[null,null,"X","X"]
[null,null,"X","X"]
[null,null,"X","X"]
[null,null,"X","X"]
[null,null,"X","X"]
[null,null,"X","X"]
[null,null,"X","X"]
[null,null,"X","X"]
[null,null,"X","X"]
[null,null,"X","X"]
[null,null,"X","X"]
[null,null,"X","X"]
[null,null,"X","X"]
[null,null,"X","X"]
[null,null,"X","X"]
[null,null,"X","X"]
[null,null,"X","X"]
[null,null,"X","X"]
[null,null,"X","X"]
[null,null,"X","X"]
[null,null,"X","X"]
[null,null,"X","X"]
[null,null,"X","X"]
[null,null,"X","X"]
[null,null,"X","X"]
[null,null,"X","X"]
[null,null,"X","X"]
[null,null,"X","X"]
[null,null,"X","X"]
[null,null,"X","X"]
[null,null,"X","X"]
[null,null,"X","X"]
[null,null,"X","X"]
[null,null,"X","X"]
[null,null,"X","X"]
[null,null,"X","X"]
[null,null,"X","X"]
[null,null,"X","X"]
[null,null,"X","X"]
[null,null,"X","X"]
[null,null,"X","X"]
[null,null,"X","X"]
[null,null,"X","X"]
[null,null,"X","X"]
[null,null,"X","X"]
[null,null,"X","X"]
[null,null,"X","X"]
[null,null,"X","X"]
[null,null,"X","X"]
[null,null,"X","X"]
[null,null,"X","X"]
[null,null,"X","X"]
[null,null,"X","X"]
[null,null,"X","X"]
[null,null,"X","X"]
[null,null,"X","X"]
[null,null,"X","X"]
[null,null,"X","X"]
[null,null,"X","X"]
[null,null,"X","X"]
[null,null,"X","X"]
[null,null,"X","X"]
[null,null,"X","X"]
[null,null,"X","X"]
[null,null,"X","X"]
[null,null,"X","X"]
[null,null,"X","X"]
[null,null,"X","X"]
[null,null,"X","X"]
[null,null,"X","X"]
[null,null,"X","X"]
[null,null,"X","X"]
[null,null,"X","X"]
[null,null,"X","X"]
[null,null,"X","X"]
[null,null,"X","X"]
[null,null,"X","X"]
[null,null,"X","X"]
[null,null,"X","X"]
[null,null,"X","X"]
[null,null,"X","X"]
[null,null,"X","X"]
[null,null,"X","X"]
[null,null,"X","X"]
[null,null,"X","X"]
[null,null,"X","X"]
[null,null,"X","X"]
[null,null,"X","X"]
[null,null,"X","X"]
[null,null,"X","X"]
[null,null,"X","X"]
[null,null,"X","X"]
[null,null,"X","X"]
[null,null,"X","X"]
[null,null,"X","X"]
[null,null,"X","X"]
[null,null,"X","X"]
[null,null,"X","X"]
[null,null,"X","X"]
[null,null,"X","X"]
[null,null,"X","X"]
[null,null,"X","X"]
[null,null,"X","X"]
[null,null,"X","X"]
[null,null,"X","X"]
[null,null,"X","X"]
[null,null,"X","X"]
[null,null,"X","X"]
[null,null,"X","X"]
[null,null,"X","X"]
[null,null,"X","X"]
[null,null,"X","X"]
[null,null,"X","X"]
[null,null,"X","X"]
[null,null,"X","X"]
[null,null,"X","X"]
[null,null,"X","X"]
[null,null,"X","X"]
[null,null,"X","X"]
[null,null,"X","X"]
[null,null,"X","X"]
[null,null,"X","X"]
[null,null,"X","X"]
[null,null,"X","X"]
[null,null,"X","X"]
[null,null,"X","X"]
[null,null,"X","X"]
[null,null,"X","X"]
[null,null,"X","X"]
[null,null,"X","X"]
[null,null,"X","X"]
[null,null,"X","X"]
[null,null,"X","X"]
[null,null,"X","X"]
[null,null,"X","X"]
[null,null,"X","X"]
[null,null,"X","X"]
[null,null,"X","X"]
[null,null,"X","X"]
[null,null,"X","X"]
[null,null,"X","X"]
[null,null,"X","X"]
[null,null,"X","X"]
[null,null,"X","X"]
[null,null,"X","X"]
[null,null,"X","X"]
[null,null,"X","X"]
[null,null,"X","X"]
[null,null,"X","X"]
[null,null,"X","X"]
[null,null,"X","X"]
[null,null,"X","X"]
[null,null,"X","X"]
[null,null,"X","X"]
[null,null,"X","X"]
[null,null,"X","X"]
[null,null,"X","X"]
[null,null,"X","X"]
[null,null,"X","X"]
[null,null,"X","X"]
[null,null,"X","X"]
[null,null,"X","X"]
[null,null,"X","X"]
[null,null,"X","X"]
[null,null,"X","X"]
[null,null,"X","X"]
[null,null,"X","X"]
[null,null,"X","X"]
[null,null,"X","X"]
[null,null,"X","X"]
[null,null,"X","X"]
[null,null,"X","X"]
[null,null,"X","X"]
[null,null,"X","X"]
[null,null,"X","X"]
[null,null,"X","X"]
[null,null,"X","X"]
[null,null,"X","X"]
[null,null,"X","X"]
[null,null,"X","X"]
[null,null,"X","X"]
[null,null,"X","X"]
[null,null,"X","X"]
[null,null,"X","X"]
[null,null,"X","X"]
[null,null,"X","X"]
[null,null,"X","X"]
[null,null,"X","X"]
[null,null,"X","X"]
[null,null,"X","X"]
[null,null,"X","X"]
[null,null,"X","X"]
[null,null,"X","X"]
[null,null,"X","X"]
[null,null,"X","X"]
[null,null,"X","X"]
[null,null,"X","X"]
[null,null,"X","X"]
[null,null,"X","X"]
[null,null,"X","X"]
[null,null,"X","X"]
[null,null,"X","X"]
[null,null,"X","X"]
[null,null,"X","X"]
[null,null,"X","X"]
[null,null,"X","X"]
[null,null,"X","X"]
[null,null,"X","X"]
[null,null,"X","X"]
[null,null,"X","X"]
[null,null,"X","X"]
[null,null,"X","X"]
[null,null,"X","X"]
[null,null,"X","X"]
[null,null,"X","X"]
[null,null,"X","X"]
[null,null,"X","X"]
[null,null,"X","X"]
[null,null,"X","X"]
[null,null,"X","X"]
[null,null,"X","X"]
[null,null,"X","X"]
[null,null,"X","X"]
[null,null,"X","X"]
[null,null,"X","X"]
[null,null,"X","X"]
[null,null,"X","X"]
[null,null,"X","X"]
[null,null,"X","X"]
[null,null,"X","X"]
[null,null,"X","X"]
[null,null,"X","X"]
[null,null,"X","X"]
[null,null,"X","X"]
[null,null,"X","X"]
[null,null,"X","X"]
[null,null,"X","X"]
[null,null,"X","X"]
[null,null,"X","X"]
[null,null,"X","X"]
[null,null,"X","X"]
[null,null,"X","X"]
[null,null,"X","X"]
[null,null,"X","X"]
[null,null,"X","X"]
[null,null,"X","X"]
[null,null,"X","X"]
[null,null,"X","X"]
[null,null,"X","X"]
[null,null,"X","X"]
[null,null,"X","X"]
[null,null,"X","X"]
[null,null,"X","X"]
[null,null,"X","X"]
[null,null,"X","X"]
[null,null,"X","X"]
[null,null,"X","X"]
[null,null,"X","X"]
[null,null,"X","X"]
[null,null,"X","X"]
[null,null,"X","X"]
[null,null,"X","X"]
[null,null,"X","X"]
[null,null,"X","X"]
[null,null,"X","X"]
[null,null,"X","X"]
[null,null,"X","X"]
[null,null,"X","X"]
[null,null,"X","X"]
[null,null,"X","X"]
[null,null,"X","X"]
[null,null,"X","X"]
[null,null,"X","X"]
[null,null,"X","X"]
[null,null,"X","X"]
[null,null,"X","X"]
[null,null,"X","X"]
[null,null,"X","X"]
[null,null,"X","X"]
[null,null,"X","X"]
[null,null,"X","X"]
[null,null,"X","X"]
[null,null,"X","X"]
[null,null,"X","X"]
[null,null,"X","X"]
[null,null,"X","X"]
[null,null,"X","X"]
[null,null,"X","X"]
[null,null,"X","X"]
[null,null,"X","X"]
[null,null,"X","X"]
[null,null,"X","X"]
[null,null,"X","X"]
[null,null,"X","X"]
[null,null,"X","X"]
[null,null,"X","X"]
[null,null,"X","X"]
[null,null,"X","X"]
[null,null,"X","X"]
[null,null,"X","X"]
[null,null,"X","X"]
[null,null,"X","X"]
[null,null,"X","X"]
[null,null,"X","X"]
[null,null,"X","X"]
[null,null,"X","X"]
[null,null,"X","X"]
[null,null,"X","X"]
[null,null,"X","X"]
[null,null,"X","X"]
[null,null,"X","X"]
[null,null,"X","X"]
[null,null,"X","X"]
[null,null,"X","X"]
[null,null,"X","X"]
[null,null,"X","X"]
[null,null,"X","X"]
[null,null,"X","X"]
[null,null,"X","X"]
[null,null,"X","X"]
[null,null,"X","X"]
[null,null,"X","X"]
[null,null,"X","X"]
[null,null,"X","X"]
[null,null,"X","X"]
[null,null,"X","X"]
[null,null,"X","X"]
[null,null,"X","X"]
[null,null,"X","X"]
[null,null,"X","X"]
[null,null,"X","X"]
[null,null,"X","X"]
[null,null,"X","X"]
[null,null,"X","X"]
[null,null,"X","X"]
[null,null,"X","X"]
[null,null,"X","X"]
[null,null,"X","X"]
[null,null,"X","X"]
[null,null,"X","X"]
[null,null,"X","X"]
[null,null,"X","X"]
[null,null,"X","X"]
[null,null,"X","X"]
[null,null,"X","X"]
[null,null,"X","X"]
[null,null,"X","X"]
[null,null,"X","X"]
[null,null,"X","X"]
[null,null,"X","X"]
[null,null,"X","X"]
[null,null,"X","X"]
[null,null,"X","X"]
[null,null,"X","X"]
[null,null,"X","X"]
[null,null,"X","X"]
[null,null,"X","X"]
[null,null,"X","X"]
[null,null,"X","X"]
[null,null,"X","X"]
[null,null,"X","X"]
[null,null,"X","X"]
[null,null,"X","X"]
[null,null,"X","X"]
[null,null,"X","X"]
[null,null,"X","X"]
[null,null,"X","X"]
[null,null,"X","X"]
[null,null,"X","X"]
[null,null,"X","X"]
[null,null,"X","X"]
[null,null,"X","X"]
[null,null,"X","X"]
[null,null,"X","X"]
[null,null,"X","X"]
[null,null,"X","X"]
[null,null,"X","X"]
[null,null,"X","X"]
[null,null,"X","X"]
[null,null,"X","X"]
[null,null,"X","X"]
[null,null,"X","X"]
[null,null,"X","X"]
[null,null,"X","X"]
[null,null,"X","X"]
[null,null,"X","X"]
[null,null,"X","X"]
[null,null,"X","X"]
[null,null,"X","X"]
[null,null,"X","X"]
[null,null,"X","X"]
[null,null,"X","X"]
[null,null,"X","X"]
[null,null,"X","X"]
[null,null,"X","X"]
[null,null,"X","X"]
[null,null,"X","X"]
[null,null,"X","X"]
[null,null,"X","X"]
[null,null,"X","X"]
[null,null,"X","X"]
[null,null,"X","X"]
[null,null,"X","X"]
[null,null,"X","X"]
[null,null,"X","X"]
[null,null,"X","X"]
[null,null,"X","X"]
[null,null,"X","X"]
[null,null,"X","X"]
[null,null,"X","X"]
[null,null,"X","X"]
[null,null,"X","X"]
[null,null,"X","X"]
[null,null,"X","X"]
[null,null,"X","X"]
[null,null,"X","X"]
[null,null,"X","X"]
[null,null,"X","X"]
[null,null,"X","X"]
[null,null,"X","X"]
[null,null,"X","X"]
[null,null,"X","X"]
[null,null,"X","X"]
[null,null,"X","X"]
[null,null,"X","X"]
[null,null,"X","X"]
[null,null,"X","X"]
[null,null,"X","X"]
[null,null,"X","X"]
[null,null,"X","X"]
[null,null,"X","X"]
[null,null,"X","X"]
[null,null,"X","X"]
[null,null,"X","X"]
[null,null,"X","X"]
[null,null,"X","X"]
[null,null,"X","X"]
[null,null,"X","X"]
[null,null,"X","X"]
[null,null,"X","X"]
[null,null,"X","X"]
[null,null,"X","X"]
[null,null,"X","X"]
[null,null,"X","X"]
[null,null,"X","X"]
[null,null,"X","X"]
[null,null,"X","X"]
[null,null,"X","X"]
[null,null,"X","X"]
[null,null,"X","X"]
[null,null,"X","X"]
[null,null,"X","X"]
[null,null,"X","X"]
[null,null,"X","X"]
[null,null,"X","X"]
[null,null,"X","X"]
[null,null,"X","X"]
[null,null,"X","X"]
[null,null,"X","X"]
[null,null,"X","X"]
[null,null,"X","X"]
[null,null,"X","X"]
[null,null,"X","X"]
[null,null,"X","X"]
[null,null,"X","X"]
[null,null,"X","X"]
[null,null,"X","X"]
[null,null,"X","X"]
[null,null,"X","X"]
[null,null,"X","X"]
[null,null,"X","X"]
[null,null,"X","X"]
[null,null,"X","X"]
[null,null,"X","X"]
[null,null,"X","X"]
[null,null,"X","X"]
[null,null,"X","X"]
[null,null,"X","X"]
[null,null,"X","X"]
[null,null,"X","X"]
[null,null,"X","X"]
[null,null,"X","X"]
[null,null,"X","X"]
[null,null,"X","X"]
[null,null,"X","X"]
[null,null,"X","X"]
[null,null,"X","X"]
[null,null,"X","X"]
[null,null,"X","X"]
[null,null,"X","X"]
[null,null,"X","X"]
[null,null,"X","X"]
[null,null,"X","X"]
[null,null,"X","X"]
[null,null,"X","X"]
[null,null,"X","X"]
[null,null,"X","X"]
[null,null,"X","X"]
[null,null,"X","X"]
[null,null,"X","X"]
[null,null,"X","X"]
[null,null,"X","X"]
[null,null,"X","X"]
[null,null,"X","X"]
[null,null,"X","X"]
[null,null,"X","X"]
[null,null,"X","X"]
[null,null,"X","X"]
[null,null,"X","X"]
[null,null,"X","X"]
[null,null,"X","X"]
[null,null,"X","X"]
[null,null,"X","X"]
[null,null,"X","X"]
[null,null,"X","X"]
[null,null,"X","X"]
[null,null,"X","X"]
[null,null,"X","X"]
[null,null,"X","X"]
[null,null,"X","X"]
[null,null,"X","X"]
[null,null,"X","X"]
[null,null,"X","X"]
[null,null,"X","X"]
[null,null,"X","X"]
[null,null,"X","X"]
[null,null,"X","X"]
[null,null,"X","X"]
[null,null,"X","X"]
[null,null,"X","X"]
[null,null,"X","X"]
[null,null,"X","X"]
[null,null,"X","X"]
[null,null,"X","X"]
[null,null,"X","X"]
[null,null,"X","X"]
[null,null,"X","X"]
[null,null,"X","X"]
[null,null,"X","X"]
[null,null,"X","X"]
[null,null,"X","X"]
[null,null,"X","X"]
[null,null,"X","X"]
[null,null,"X","X"]
[null,null,"X","X"]
[null,null,"X","X"]
[null,null,"X","X"]
[null,null,"X","X"]
[null,null,"X","X"]
[null,null,"X","X"]
[null,null,"X","X"]
[null,null,"X","X"]
[null,null,"X","X"]
[null,null,"X","X"]
[null,null,"X","X"]
[null,null,"X","X"]
[null,null,"X","X"]
[null,null,"X","X"]
[null,null,"X","X"]
[null,null,"X","X"]
[null,null,"X","X"]
[null,null,"X","X"]
[null,null,"X","X"]
[null,null,"X","X"]
[null,null,"X","X"]
[null,null,"X","X"]
[null,null,"X","X"]
[null,null,"X","X"]
[null,null,"X","X"]
[null,null,"X","X"]
[null,null,"X","X"]
[null,null,"X","X"]
[null,null,"X","X"]
[null,null,"X","X"]
[null,null,"X","X"]
[null,null,"X","X"]
[null,null,"X","X"]
[null,null,"X","X"]
[null,null,"X","X"]
[null,null,"X","X"]
[null,null,"X","X"]
[null,null,"X","X"]
[null,null,"X","X"]
[null,null,"X","X"]
[null,null,"X","X"]
[null,null,"X","X"]
[null,null,"X","X"]
[null,null,"X","X"]
[null,null,"X","X"]
[null,null,"X","X"]
[null,null,"X","X"]
[null,null,"X","X"]
[null,null,"X","X"]
[null,null,"X","X"]
[null,null,"X","X"]
[null,null,"X","X"]
[null,null,"X","X"]
[null,null,"X","X"]
[null,null,"X","X"]
[null,null,"X","X"]
[null,null,"X","X"]
[null,null,"X","X"]
[null,null,"X","X"]
[null,null,"X","X"]
[null,null,"X","X"]
[null,null,"X","X"]
[null,null,"X","X"]
[null,null,"X","X"]
[null,null,"X","X"]
[null,null,"X","X"]
[null,null,"X","X"]
[null,null,"X","X"]
[null,null,"X","X"]
[null,null,"X","X"]
[null,null,"X","X"]
[null,null,"X","X"]
[null,null,"X","X"]
[null,null,"X","X"]
[null,null,"X","X"]
[null,null,"X","X"]
[null,null,"X","X"]
[null,null,"X","X"]
[null,null,"X","X"]
[null,null,"X","X"]
[null,null,"X","X"]
[null,null,"X","X"]
[null,null,"X","X"]
[null,null,"X","X"]
[null,null,"X","X"]
[null,null,"X","X"]
[null,null,"X","X"]

{"sheet":"Comercializacao","index":2,"n_rows":46,"n_cols":6,"rows_kept":46,"merged":[[0,1,0,6],[2,3,2,5],[3,2,3,5],[44,5,45,5]]}
[null,"LEIA O MANUAL E AS EXPLICAÇÕES ABAIXO PARA CORRETO USO DA TABELA"]
[]
[null,null,"6.0","LEVANTAMENTO DO FATURAMENTO DOS CANAIS DE MERCADO E ESTRUTURA DE COMERCIALIZAÇÃO"]
[null,null,"considerar a soma do último ano civil"]
[null,null,"N","CANAIS DE MERCADO","FATURAMENTO EM R$","LOCAIS DE VENDA"]
[null,null,"6.01","TOTAL nos Mercados Convencional e Institucional",{"$f":"SUM(E7,E20)","v":{"v":0,"d":"0.00"}}]
[null,null,"6.02","TOTAL no Mercado Privado (Convencional)",{"$f":"SUM(E8,E16:E19)","v":{"v":0,"d":"0.00"}}]
[null,null,"6.03","TOTAL no Varejo",{"$f":"SUM(E9:E15)","v":{"v":0,"d":"0.00"}}]
[null,null,"6.04","Feira Livre"]
[null,null,"6.05","Varejo Local (restaurante/sacolão/hotel)"]
[null,null,"6.06","Supermercados"]
[null,null,"6.07","Loja Própria"]
[null,null,"6.08","Redes de Empreendimentos"]
[null,null,"6.09","CEASA e Outros Centros de Abastecimento"]
[null,null,"6.10","Outros Canais de Varejo"]
[null,null,"6.11","Atacado"]
[null,null,"6.12","Exportação"]
[null,null,"6.13","Outros Canais no Mercado Privado"]
[null,null,"6.14","Valores não Especificados no Mercado Privado"]
[null,null,"6.15","TOTAL no Mercado Institucional",{"$f":"SUM(E21,E27:E31)","v":{"v":0,"d":"0.00"}}]
[null,null,"6.16","TOTAL no PAA",{"$f":"SUM(E22:E26)","v":{"v":0,"d":"0.00"}}]
[null,null,"6.17","PAA Doação Simultânea via CONAB"]
[null,null,"6.18","PAA Doação Simultânea via Prefeitura/Estado"]
[null,null,"6.19","PAA Formação Estoque"]
[null,null,"6.20","PAA Institucional"]
[null,null,"6.21","PAA Leite"]
[null,null,"6.22","PNAE"]
[null,null,"6.23","BIODIESEL"]
[null,null,"6.24","Programas Estaduais"]
[null,null,"6.25","Outros Mercados Institucionais"]
[null,null,"6.26","Valores não Especificados no Merc. Institucional"]
[null,null,"6.27","Participação % do Mercado Institucional",{"$f":"IF(E6=0,\"SR\",E20/E6)","v":"SR"},"OPÇÕES DE LOCAIS DE VENDA"]
[null,null,"X","X","X","Só no Município"]
[null,null,"6.28","EMISSÃO DE NOTA FISCAL","MARQUE \"X\"","Só Dentro do Estado"]
[null,null,"6.29","Bloco de NF Próprio",null,"Só Fora do Estado"]
[null,null,"6.30","Bloco de Nota de Produtor Rural",null,"Município + Estado"]
[null,null,"6.31","NF Eletrônica com Chave Própria",null,"Município + Fora do Estado"]
[null,null,"6.32","NF Eletrônica com Chave de Terceiros",null,"no Estado + Fora do Estado"]
[null,null,"6.33","NF Avulsa",null,"Todo Local"]
[null,null,"6.34","Não Emite NF",null,"Não se Aplica"]
[]
[null,null,"6.35","Existe responsável pela parte da comercialização?\nSe SIM Especificar:",null,"lista: sim ou não"]
[null,null,"6.36","Nome do Responsável Comercial",null,"livre"]
[null,null,"6.37","Cargo do Responsável Comercial",null,"livre"]
[null,null,"6.38","Telefone do Responsável",null,"somente números: 10 ou 11 dígitos:\n2 do DDD + 4 ou 5 do prefixo + 4 finais"]
[null,null,"6.39","E-mail do Responsável"]

{"sheet":"OBSERVACAO","index":3,"n_rows":32,"n_cols":6,"rows_kept":32,"merged":[[0,1,0,6],[2,3,2,5],[31,3,31,5]]}
[null,"LEIA A PLANILHA INTRO E AS EXPLICAÇÕES ABAIXO PARA CORRETO USO DA TABELA"]
[]
[{"$nulls":3},"RELATE AS OBSERVAÇÕES QUE JULGUE PERTINENTE IDENTIFICANDO A PLANILHA OU OUTRO ASSUNTO"]
[]
[null,null,"N","TABELA","QUESTÃO","OBSERVAÇÃO"]
[null,null,{"$f":"ROW(A6)-5","v":1}]
[null,null,{"$f":"ROW(A7)-5","v":2}]
[null,null,3]
[null,null,4]
[null,null,5]
[null,null,6]
[null,null,7]
[null,null,8]
[null,null,9]
[null,null,10]
[null,null,{"$f":"ROW(A16)-5","v":11}]
[null,null,{"$f":"ROW(A17)-5","v":12}]
[null,null,{"$f":"ROW(A18)-5","v":13}]
[null,null,{"$f":"ROW(A19)-5","v":14}]
[null,null,{"$f":"ROW(A20)-5","v":15}]
[null,null,{"$f":"ROW(A21)-5","v":16}]
[null,null,{"$f":"ROW(A22)-5","v":17}]
[null,null,{"$f":"ROW(A23)-5","v":18}]
[null,null,{"$f":"ROW(A24)-5","v":19}]
[null,null,{"$f":"ROW(A25)-5","v":20}]
[null,null,{"$f":"ROW(A26)-5","v":21}]
[null,null,{"$f":"ROW(A27)-5","v":22}]
[null,null,{"$f":"ROW(A28)-5","v":23}]
[null,null,{"$f":"ROW(A29)-5","v":24}]
[null,null,{"$f":"ROW(A30)-5","v":25}]
[null,"##",null,"OUTRA"]
[{"$nulls":3},"digitar a sigla de uma as planilhas e o número ao lado da questão a observar ou; \ndigitar \"OUTRA\" em PLANILHA e QUESTÃO para assunto assunto diverso às planilhas ou; \ndigitar \"OUTRA\" em QUESTÃO para assunto correlato à planilha referenciada, mas diverso às questões na planilha."]

{"sheet":"LISTAS","index":4,"n_rows":5599,"n_cols":23,"rows_kept":5599,"hidden":true}
[]
[null,"UF","MUNICÍPIO",{"$f":"CONCATENATE(B2,\" - \",C2)","v":"UF - MUNICÍPIO"},"CÓDIGO",null,"UF",null,"SINGULAR/CENTRAL",null,"PERIODICIDADE",null,"UNIDADEmedida",null,"PRODUTO",null,"AGROINDÚSTRIA",null,"PROPRIEDADE",null,"TABELA",null,"QUESTÃO"]
[null,"AC","Acrelândia",{"$f":"CONCATENATE(B3,\" - \",C3)","v":"AC - Acrelândia"},{"v":1200013,"d":"12.00.0.13"},null,"AC",null,"Singular",null,"diário",null,"g",null,"ABACATE",null,"Alambique",null,"da Cooperativa",null,"MANUAL",null,"OUTRA"]
[null,"AC","Assis Brasil","AC - Assis Brasil",{"v":1200054,"d":"12.00.0.54"},null,"AL",null,"Central",null,"semanal",null,"kg",null,"ABACAXI",null,"Apiário",null,"de Associado",null,"Producao",null,"5.01"]
[null,"AC","Brasiléia","AC - Brasiléia",{"v":1200104,"d":"12.00.1.04"},null,"AM",{"$nulls":3},"quinzenal",null,"ton",null,"ABÓBORA",null,"Beneficiadora de Grãos",null,"Comodato",null,"Comercializacao",null,"5.02"]
[null,"AC","Bujari","AC - Bujari",{"v":1200138,"d":"12.00.1.38"},null,"AP",null,"MATRIZ/FILIAL",null,"mensal",null,"mL",null,"ABOBRINHA",null,"Cervejaria",null,"Alugado",null,"OBSERVACAO",null,"5.03"]
[null,"AC","Capixaba","AC - Capixaba",{"v":1200179,"d":"12.00.1.79"},null,"BA",null,"Matriz",null,"bimestral",null,"litro",null,"ABRICÓ",null,"Charqueada",null,"Terceirizado",null,"OUTRA",null,"5.04"]
[null,"AC","Cruzeiro do Sul","AC - Cruzeiro do Sul",{"v":1200203,"d":"12.00.2.03"},null,"CE",null,"Filial",null,"trimestral",null,"m³",null,"ABRÓTEA",null,"Engenho",{"$nulls":5},"5.05"]
[null,"AC","Epitaciolândia","AC - Epitaciolândia",{"v":1200252,"d":"12.00.2.52"},null,"DF",{"$nulls":3},"quadrimestral",null,"unidade",null,"AÇAFRÃO",null,"Entreposto de Mel e afins",null,"REGISTROsanitário",null,"ATUAÇÃO",null,"5.06"]
[null,"AC","Feijó","AC - Feijó",{"v":1200302,"d":"12.00.3.02"},null,"ES",null,"SIM/NÃO",null,"semestral",null,"dúzia",null,"AÇAÍ",null,"Entreposto de Ovos",null,"SIM",null,"Municipal",null,"5.07"]
[null,"AC","Jordão","AC - Jordão",{"v":1200328,"d":"12.00.3.28"},null,"GO",null,"SIM",null,"anual",null,"milheiro",null,"ACARÁ",null,"Entreposto de Pescado",null,"SIE",null,"Regional",null,"5.08"]
[null,"AC","Mâncio Lima","AC - Mâncio Lima",{"v":1200336,"d":"12.00.3.36"},null,"MA",null,"NÃO",null,"bianual",{"$nulls":3},"ACELGA",null,"Entreposto-Frigorífico",null,"SIF",null,"Territorial",null,"5.09"]
[null,"AC","Manoel Urbano","AC - Manoel Urbano",{"v":1200344,"d":"12.00.3.44"},null,"MG",null,"Não se Aplica",{"$nulls":3},"TIPOproduto",null,"ACEROLA",null,"Entreposto-Laticínio",null,"MAPA",null,"Estadual",null,"5.10"]
[null,"AC","Marechal Thaumaturgo","AC - Marechal Thaumaturgo",{"v":1200351,"d":"12.00.3.51"},null,"MS",{"$nulls":3},"GRATUITA/PAGA",null,"SocioBiodiversidade",null,"ACHOCOLATADO EM PÓ",null,"Entrepostos de Carnes e Derivados",null,"VISA",null,"Interestadual",null,"5.11"]
[null,"AC","Plácido de Castro","AC - Plácido de Castro",{"v":1200385,"d":"12.00.3.85"},null,"MT",null,"FEM/MASC",null,"Gratuita",null,"Agroecológico",null,"AÇÚCAR",null,"Entreposto-Usina",null,"não tem",null,"Nacional",null,"5.12"]
[null,"AC","Porto Acre","AC - Porto Acre",{"v":1200807,"d":"12.00.8.07"},null,"PA",null,"Feminino",null,"Paga",null,"Orgânico",null,"AGRIÃO",null,"Esmagadora de Grãos",{"$nulls":3},"Internacional",null,"5.13"]
[null,"AC","Porto Walter","AC - Porto Walter",{"v":1200393,"d":"12.00.3.93"},null,"PB",null,"Masculino",{"$nulls":3},"Convencional",null,"AGULHÃO",null,"Padronizadora e Envasadora de Aguardentes",null,"LOCALvenda",null,"Não se Aplica",null,"5.14"]
[null,"AC","Rio Branco","AC - Rio Branco",{"v":1200401,"d":"12.00.4.01"},null,"PE",{"$nulls":3},"AGENTEfinanceiro",null,"Transgênico",null,"ALBACORA",null,"Fábrica de Bebidas",null,"Só no Município",{"$nulls":3},"5.15"]
[null,"AC","Rodrigues Alves","AC - Rodrigues Alves",{"v":1200427,"d":"12.00.4.27"},null,"PI",null,"DEDICAÇÃO",null,"Coop. Crédito",{"$nulls":3},"ALFACE",null,"Fábrica de Beneficiamento de Cacau ",null,"Só Dentro do Estado",null,"MERCADO",null,"5.16"]
[null,"AC","Santa Rosa do Purus","AC - Santa Rosa do Purus",{"v":1200435,"d":"12.00.4.35"},null,"PR",null,"integral",null,"Banco Público",null,"MANIPULAÇÃO",null,"ALFAVACA",null,"Fábrica de Biscoitos/Bolachas",null,"Só Fora do Estado",null,"Institucional",null,"5.17"]
[null,"AC","Sena Madureira","AC - Sena Madureira",{"v":1200500,"d":"12.00.5.00"},null,"RJ",null,"parcial",null,"Banco Privado",null,"In Natura",null,"ALGODÃO EM CAROÇO",null,"Fábrica de Beneficiamento de Café",null,"Município + Estado",null,"Convencional",null,"5.18"]
[null,"AC","Senador Guiomard","AC - Senador Guiomard",{"v":1200450,"d":"12.00.4.50"},null,"RN",null,"por demanda",null,"OUTRO",null,"Beneficiado",null,"ALGODÃO EM PLUMA",null,"Fábrica de Conserva de Ovos",null,"Município + Fora do Estado",null,"Indefinido",null,"5.19"]
[null,"AC","Tarauacá","AC - Tarauacá",{"v":1200609,"d":"12.00.6.09"},null,"RO",{"$nulls":5},"Classificado",null,"ALHO",null,"Fábrica de Conservas",null,"no Estado + Fora do Estado",{"$nulls":3},"5.20"]
[null,"AC","Xapuri","AC - Xapuri",{"v":1200708,"d":"12.00.7.08"},null,"RR",null,"SEDE",{"$nulls":3},"Processado",null,"ALHO E SAL",null,"Fábrica de Conservas de Pescado",null,"Todo Local",{"$nulls":3},"5.21"]
[null,"AL","Água Branca","AL - Água Branca",{"v":2700102,"d":"27.00.1.02"},null,"RS",null,"Própria",{"$nulls":5},"ALHO EM PÓ",null,"Fábrica de Doces de Frutas",null,"Não se Aplica",{"$nulls":3},"5.22"]
[null,"AL","Anadia","AL - Anadia",{"v":2700201,"d":"27.00.2.01"},null,"SC",null,"Alugada",{"$nulls":3},"EMBALAGEMprima",null,"ALMEIRÃO",null,"Fábrica de Especiarias, Temperos, Condimentos e Molhos",{"$nulls":5},"5.23"]
[null,"AL","Arapiraca","AL - Arapiraca",{"v":2700300,"d":"27.00.3.00"},null,"SE",null,"Cedida",{"$nulls":3},"bag",null,"ALPISTE",null,"Fábrica de Frutas e Hortaliças Desidratadas",null,"SNP",{"$nulls":3},"5.24"]
[null,"AL","Atalaia","AL - Atalaia",{"v":2700409,"d":"27.00.4.09"},null,"SP",{"$nulls":5},"balde",null,"AMEIXA",null,"Fábrica de Frutas em Conserva",null,"SIM",{"$nulls":3},"5.25"]
[null,"AL","Barra de Santo Antônio","AL - Barra de Santo Antônio",{"v":2700508,"d":"27.00.5.08"},null,"TO",{"$nulls":5},"caixa madeira",null,"AMENDOIM",null,"Fábrica de Hortaliças em Conserva",null,"NÃO",{"$nulls":3},"5.26"]
[null,"AL","Barra de São Miguel","AL - Barra de São Miguel",{"v":2700607,"d":"27.00.6.07"},{"$nulls":7},"caixa papel",null,"AMORA",null,"Laticínios",null,"Parcial",{"$nulls":3},"5.27"]
[null,"AL","Batalha","AL - Batalha",{"v":2700706,"d":"27.00.7.06"},{"$nulls":7},"caixa plástico",null,"ANIMAL",null,"Fábrica de Massas Alimentícias",null,"Não se Aplica",{"$nulls":3},"5.28"]
[null,"AL","Belém","AL - Belém",{"v":2700805,"d":"27.00.8.05"},{"$nulls":7},"caixa tetrapack",null,"APAIARI",null,"Fábrica de Produtos Gordurosos",{"$nulls":5},"5.29"]
[null,"AL","Belo Monte","AL - Belo Monte",{"v":2700904,"d":"27.00.9.04"},{"$nulls":7},"cartonado",null,"ARAÇÁ",null,"Fábrica de Produtos Minimamente Processados",{"$nulls":5},"5.30"]
[null,"AL","Boca da Mata","AL - Boca da Mata",{"v":2701001,"d":"27.01.0.01"},{"$nulls":7},"garrafa plástica",null,"ARACU",null,"Fábrica de Produtos não-Comestíveis",{"$nulls":5},"5.31"]
[null,"AL","Branquinha","AL - Branquinha",{"v":2701100,"d":"27.01.1.00"},{"$nulls":7},"garrafa vidro",null,"ARIACÓ",null,"Fábrica de Produtos Suínos",{"$nulls":5},"5.32"]
[null,"AL","Cacimbinhas","AL - Cacimbinhas",{"v":2701209,"d":"27.01.2.09"},{"$nulls":7},"granel",null,"ARRAIA",null,"Fábrica de Sorvetes",{"$nulls":5},"5.33"]
[null,"AL","Cajueiro","AL - Cajueiro",{"v":2701308,"d":"27.01.3.08"},{"$nulls":7},"lata",null,"ARROZ",null,"Fábricas de Molhos",{"$nulls":5},"5.34"]
[null,"AL","Campestre","AL - Campestre",{"v":2701357,"d":"27.01.3.57"},{"$nulls":7},"pacote papel",null,"ARUANÂ",null,"Farinheira",{"$nulls":5},"5.35"]
[null,"AL","Campo Alegre","AL - Campo Alegre",{"v":2701407,"d":"27.01.4.07"},{"$nulls":7},"pacote plástico",null,"ATEMÓIA",null,"Fecularia",{"$nulls":5},"5.36"]
[null,"AL","Campo Grande","AL - Campo Grande",{"v":2701506,"d":"27.01.5.06"},{"$nulls":7},"pacote vácuo",null,"ATUM",null,"Matadouro",{"$nulls":5},"5.37"]
[null,"AL","Canapi","AL - Canapi",{"v":2701605,"d":"27.01.6.05"},{"$nulls":7},"palha",null,"AVEIA",null,"Matadouro de Aves e Coelhos",{"$nulls":5},"5.38"]
[null,"AL","Capela","AL - Capela",{"v":2701704,"d":"27.01.7.04"},{"$nulls":7},"pote plástico",null,"AVESTRUZ",null,"Matadouro de Pequenos e Médios Animais",{"$nulls":5},"5.39"]
[null,"AL","Carneiros","AL - Carneiros",{"v":2701803,"d":"27.01.8.03"},{"$nulls":7},"pote vidro",null,"AZEITE DE BABAÇU",null,"Matadouro-Frigorífico",{"$nulls":5},"5.40"]
[null,"AL","Chã Preta","AL - Chã Preta",{"v":2701902,"d":"27.01.9.02"},{"$nulls":7},"sachê",null,"AZEITE DE COCO",null,"Moinho de Milho",{"$nulls":5},"5.41"]
[null,"AL","Coité do Nóia","AL - Coité do Nóia",{"v":2702009,"d":"27.02.0.09"},{"$nulls":7},"tambor",null,"AZEITE DE OLIVA",null,"Moinho de Trigo",{"$nulls":5},"5.42"]
[null,"AL","Colônia Leopoldina","AL - Colônia Leopoldina",{"v":2702108,"d":"27.02.1.08"},{"$nulls":7},"OUTRO",null,"BACABA",null,"Packing-House",{"$nulls":5},"5.43"]
[null,"AL","Coqueiro Seco","AL - Coqueiro Seco",{"v":2702207,"d":"27.02.2.07"},{"$nulls":9},"BACURI",null,"Panificadora",{"$nulls":5},"5.44"]
[null,"AL","Coruripe","AL - Coruripe",{"v":2702306,"d":"27.02.3.06"},{"$nulls":9},"BADEJO",null,"Posto de Coagulação",{"$nulls":5},"5.45"]
[null,"AL","Craíbas","AL - Craíbas",{"v":2702355,"d":"27.02.3.55"},{"$nulls":9},"BAGRE",null,"Posto de Recebimento",{"$nulls":5},"5.46"]
[null,"AL","Delmiro Gouveia","AL - Delmiro Gouveia",{"v":2702405,"d":"27.02.4.05"},{"$nulls":9},"BALA",null,"Posto de Refrigeração",{"$nulls":5},"5.47"]
[null,"AL","Dois Riachos","AL - Dois Riachos",{"v":2702504,"d":"27.02.5.04"},{"$nulls":9},"BANANA",null,"Queijaria",{"$nulls":5},"5.48"]
[null,"AL","Estrela de Alagoas","AL - Estrela de Alagoas",{"v":2702553,"d":"27.02.5.53"},{"$nulls":9},"BANANA DESIDRATADA",null,"Refinaria de Gorduras Vegetais",{"$nulls":5},"5.49"]
[null,"AL","Feira Grande","AL - Feira Grande",{"v":2702603,"d":"27.02.6.03"},{"$nulls":9},"BANANA FRITA",null,"Refinaria de Óleos Vegetais",{"$nulls":5},"5.50"]
[null,"AL","Feliz Deserto","AL - Feliz Deserto",{"v":2702702,"d":"27.02.7.02"},{"$nulls":9},"BANANA PASSA",null,"Torrefadora de Café",{"$nulls":5},"6.01"]
[null,"AL","Flexeiras","AL - Flexeiras",{"v":2702801,"d":"27.02.8.01"},{"$nulls":9},"BANHA",null,"Usina de Açúcar",{"$nulls":5},"6.02"]
[null,"AL","Girau do Ponciano","AL - Girau do Ponciano",{"v":2702900,"d":"27.02.9.00"},{"$nulls":9},"BARRA DE CEREAL",null,"Unidade de Beneficiamento",{"$nulls":5},"6.03"]
[null,"AL","Ibateguara","AL - Ibateguara",{"v":2703007,"d":"27.03.0.07"},{"$nulls":9},"BARU",null,"Vinícola",{"$nulls":5},"6.04"]
[null,"AL","Igaci","AL - Igaci",{"v":2703106,"d":"27.03.1.06"},{"$nulls":9},"BATATA",null,"#AgroInd56",{"$nulls":5},"6.05"]
[null,"AL","Igreja Nova","AL - Igreja Nova",{"v":2703205,"d":"27.03.2.05"},{"$nulls":9},"BEBIDA LÁCTEA",null,"#AgroInd57",{"$nulls":5},"6.06"]
[null,"AL","Inhapi","AL - Inhapi",{"v":2703304,"d":"27.03.3.04"},{"$nulls":9},"BEIJU",null,"#AgroInd58",{"$nulls":5},"6.07"]
[null,"AL","Jacaré dos Homens","AL - Jacaré dos Homens",{"v":2703403,"d":"27.03.4.03"},{"$nulls":9},"BEIJU DE MILHO",null,"#AgroInd59",{"$nulls":5},"6.08"]
[null,"AL","Jacuípe","AL - Jacuípe",{"v":2703502,"d":"27.03.5.02"},{"$nulls":9},"BERINJELA",null,"#AgroInd60",{"$nulls":5},"6.09"]
[null,"AL","Japaratinga","AL - Japaratinga",{"v":2703601,"d":"27.03.6.01"},{"$nulls":9},"BERTALHA",null,"#AgroInd61",{"$nulls":5},"6.10"]
[null,"AL","Jaramataia","AL - Jaramataia",{"v":2703700,"d":"27.03.7.00"},{"$nulls":9},"BETARRA",null,"#AgroInd62",{"$nulls":5},"6.11"]
[null,"AL","Jequiá da Praia","AL - Jequiá da Praia",{"v":2703759,"d":"27.03.7.59"},{"$nulls":9},"BETERRABA",null,"#AgroInd63",{"$nulls":5},"6.12"]
[null,"AL","Joaquim Gomes","AL - Joaquim Gomes",{"v":2703809,"d":"27.03.8.09"},{"$nulls":9},"BEZERRO",null,"#AgroInd64",{"$nulls":5},"6.13"]
[null,"AL","Jundiá",{"$f":"CONCATENATE(B67,\" - \",C67)","v":"AL - Jundiá"},{"v":2703908,"d":"27.03.9.08"},{"$nulls":9},"BIQUARA",null,"#AgroInd65",{"$nulls":5},"6.14"]
[null,"AL","Junqueiro","AL - Junqueiro",{"v":2704005,"d":"27.04.0.05"},{"$nulls":9},"BISCOITO",null,"#AgroInd66",{"$nulls":5},"6.15"]
[null,"AL","Lagoa da Canoa","AL - Lagoa da Canoa",{"v":2704104,"d":"27.04.1.04"},{"$nulls":9},"BOCAIÚVA",null,"#AgroInd67",{"$nulls":5},"6.16"]
[null,"AL","Limoeiro de Anadia","AL - Limoeiro de Anadia",{"v":2704203,"d":"27.04.2.03"},{"$nulls":9},"BOI",null,"#AgroInd68",{"$nulls":5},"6.17"]
[null,"AL","Maceió","AL - Maceió",{"v":2704302,"d":"27.04.3.02"},{"$nulls":9},"BOLACHA",null,"#AgroInd69",{"$nulls":5},"6.18"]
[null,"AL","Major Isidoro","AL - Major Isidoro",{"v":2704401,"d":"27.04.4.01"},{"$nulls":9},"BOLO",null,"#AgroInd70",{"$nulls":5},"6.19"]
[null,"AL","Mar Vermelho","AL - Mar Vermelho",{"v":2704906,"d":"27.04.9.06"},{"$nulls":9},"BOMBOM DE CHOCOLATE",null,"#AgroInd71",{"$nulls":5},"6.20"]
[null,"AL","Maragogi","AL - Maragogi",{"v":2704500,"d":"27.04.5.00"},{"$nulls":9},"BORRACHA NATURAL",null,"#AgroInd72",{"$nulls":5},"6.21"]
[null,"AL","Maravilha","AL - Maravilha",{"v":2704609,"d":"27.04.6.09"},{"$nulls":9},"BRANQUINHA",null,"#AgroInd73",{"$nulls":5},"6.22"]
[null,"AL","Marechal Deodoro","AL - Marechal Deodoro",{"v":2704708,"d":"27.04.7.08"},{"$nulls":9},"BROA",null,"#AgroInd74",{"$nulls":5},"6.23"]
[null,"AL","Maribondo","AL - Maribondo",{"v":2704807,"d":"27.04.8.07"},{"$nulls":9},"BRÓCOLIS",null,"#AgroInd75",{"$nulls":5},"6.24"]
[null,"AL","Mata Grande","AL - Mata Grande",{"v":2705002,"d":"27.05.0.02"},{"$nulls":9},"BUDIÃO",null,"#AgroInd76",{"$nulls":5},"6.25"]
[null,"AL","Matriz de Camaragibe","AL - Matriz de Camaragibe",{"v":2705101,"d":"27.05.1.01"},{"$nulls":9},"BURITI",null,"#AgroInd77",{"$nulls":5},"6.26"]
[null,"AL","Messias","AL - Messias",{"v":2705200,"d":"27.05.2.00"},{"$nulls":9},"BURRO DOMADO",null,"#AgroInd78",{"$nulls":5},"6.27"]
[null,"AL","Minador do Negrão","AL - Minador do Negrão",{"v":2705309,"d":"27.05.3.09"},{"$nulls":9},"BUTIÁ",null,"#AgroInd79",{"$nulls":5},"6.28"]
[null,"AL","Monteirópolis","AL - Monteirópolis",{"v":2705408,"d":"27.05.4.08"},{"$nulls":9},"CABRA",null,"#AgroInd80",{"$nulls":5},"6.29"]
[null,"AL","Murici","AL - Murici",{"v":2705507,"d":"27.05.5.07"},{"$nulls":9},"CAÇÃO",null,"#AgroInd81",{"$nulls":5},"6.30"]
[null,"AL","Novo Lino","AL - Novo Lino",{"v":2705606,"d":"27.05.6.06"},{"$nulls":9},"CACAU",null,"#AgroInd82",{"$nulls":5},"6.31"]
[null,"AL","Olho d'Água das Flores","AL - Olho d'Água das Flores",{"v":2705705,"d":"27.05.7.05"},{"$nulls":9},"CAFÉ",null,"#AgroInd83",{"$nulls":5},"6.32"]
[null,"AL","Olho d'Água do Casado","AL - Olho d'Água do Casado",{"v":2705804,"d":"27.05.8.04"},{"$nulls":9},"CAJÁ",null,"#AgroInd84",{"$nulls":5},"6.33"]
[null,"AL","Olho d'Água Grande","AL - Olho d'Água Grande",{"v":2705903,"d":"27.05.9.03"},{"$nulls":9},"CAJU",null,"#AgroInd85",{"$nulls":5},"6.34"]
[null,"AL","Olivença","AL - Olivença",{"v":2706000,"d":"27.06.0.00"},{"$nulls":9},"CAJUÍNA",null,"#AgroInd86",{"$nulls":5},"6.35"]
[null,"AL","Ouro Branco","AL - Ouro Branco",{"v":2706109,"d":"27.06.1.09"},{"$nulls":9},"CAMARÃO",null,"#AgroInd87",{"$nulls":5},"6.36"]
[null,"AL","Palestina","AL - Palestina",{"v":2706208,"d":"27.06.2.08"},{"$nulls":9},"CANA DE AÇÚCAR",null,"#AgroInd88",{"$nulls":5},"6.37"]
[null,"AL","Palmeira dos Índios","AL - Palmeira dos Índios",{"v":2706307,"d":"27.06.3.07"},{"$nulls":9},"CANELA",null,"#AgroInd89",{"$nulls":5},"6.38"]
[null,"AL","Pão de Açúcar","AL - Pão de Açúcar",{"v":2706406,"d":"27.06.4.06"},{"$nulls":9},"CANGULO",null,"#AgroInd90",{"$nulls":5},"6.39"]
[null,"AL","Pariconha","AL - Pariconha",{"v":2706422,"d":"27.06.4.22"},{"$nulls":9},"CANJICA DE MILHO",null,"#AgroInd91",{"$nulls":5},"OUTRA"]
[null,"AL","Paripueira","AL - Paripueira",{"v":2706448,"d":"27.06.4.48"},{"$nulls":9},"CANOLA",null,"#AgroInd92"]
[null,"AL","Passo de Camaragibe","AL - Passo de Camaragibe",{"v":2706505,"d":"27.06.5.05"},{"$nulls":9},"CAPARARI",null,"#AgroInd93"]
[null,"AL","Paulo Jacinto","AL - Paulo Jacinto",{"v":2706604,"d":"27.06.6.04"},{"$nulls":9},"CAPIM",null,"#AgroInd94"]
[null,"AL","Penedo","AL - Penedo",{"v":2706703,"d":"27.06.7.03"},{"$nulls":9},"CAPRINO",null,"#AgroInd95"]
[null,"AL","Piaçabuçu","AL - Piaçabuçu",{"v":2706802,"d":"27.06.8.02"},{"$nulls":9},"CAQUI",null,"#AgroInd96"]
[null,"AL","Pilar","AL - Pilar",{"v":2706901,"d":"27.06.9.01"},{"$nulls":9},"CARÁ",null,"#AgroInd97"]
[null,"AL","Pindoba","AL - Pindoba",{"v":2707008,"d":"27.07.0.08"},{"$nulls":9},"CARAMBOLA",null,"#AgroInd98"]
[null,"AL","Piranhas","AL - Piranhas",{"v":2707107,"d":"27.07.1.07"},{"$nulls":9},"CARANGUEJO",null,"#AgroInd99"]
[null,"AL","Poço das Trincheiras","AL - Poço das Trincheiras",{"v":2707206,"d":"27.07.2.06"},{"$nulls":9},"CARAPAU",null,"#AgroInd100"]
[null,"AL","Porto Calvo","AL - Porto Calvo",{"v":2707305,"d":"27.07.3.05"},{"$nulls":9},"CARAPEBA",null,"#AgroInd101"]
[null,"AL","Porto de Pedras","AL - Porto de Pedras",{"v":2707404,"d":"27.07.4.04"},{"$nulls":9},"CARAPICU",null,"#AgroInd102"]
[null,"AL","Porto Real do Colégio","AL - Porto Real do Colégio",{"v":2707503,"d":"27.07.5.03"},{"$nulls":9},"CARATINGA",null,"#AgroInd103"]
[null,"AL","Quebrangulo","AL - Quebrangulo",{"v":2707602,"d":"27.07.6.02"},{"$nulls":9},"CARERU",null,"#AgroInd104"]
[null,"AL","Rio Largo","AL - Rio Largo",{"v":2707701,"d":"27.07.7.01"},{"$nulls":9},"CARNE BOVINA",null,"#AgroInd105"]
[null,"AL","Roteiro","AL - Roteiro",{"v":2707800,"d":"27.07.8.00"},{"$nulls":9},"CARNE CAPRINA",null,"#AgroInd106"]
[null,"AL","Santa Luzia do Norte","AL - Santa Luzia do Norte",{"v":2707909,"d":"27.07.9.09"},{"$nulls":9},"CARNE DE BÚFALO",null,"#AgroInd107"]
[null,"AL","Santana do Ipanema","AL - Santana do Ipanema",{"v":2708006,"d":"27.08.0.06"},{"$nulls":9},"CARNE DE FRANGO",null,"#AgroInd108"]
[null,"AL","Santana do Mundaú","AL - Santana do Mundaú",{"v":2708105,"d":"27.08.1.05"},{"$nulls":9},"CARNE DE PEIXE",null,"#AgroInd109"]
[null,"AL","São Brás","AL - São Brás",{"v":2708204,"d":"27.08.2.04"},{"$nulls":9},"CARNE OVINA",null,"#AgroInd110"]
[null,"AL","São José da Laje","AL - São José da Laje",{"v":2708303,"d":"27.08.3.03"},{"$nulls":9},"CARNE SUÍNA",null,"#AgroInd111"]
[null,"AL","São José da Tapera","AL - São José da Tapera",{"v":2708402,"d":"27.08.4.02"},{"$nulls":9},"CAROÇO DE ALGODÃO",null,"#AgroInd112"]
[null,"AL","São Luís do Quitunde","AL - São Luís do Quitunde",{"v":2708501,"d":"27.08.5.01"},{"$nulls":9},"CARPA",null,"#AgroInd113"]
[null,"AL","São Miguel dos Campos","AL - São Miguel dos Campos",{"v":2708600,"d":"27.08.6.00"},{"$nulls":9},"CASCOTE",null,"#AgroInd114"]
[null,"AL","São Miguel dos Milagres","AL - São Miguel dos Milagres",{"v":2708709,"d":"27.08.7.09"},{"$nulls":9},"CASCUDO",null,"#AgroInd115"]
[null,"AL","São Sebastião","AL - São Sebastião",{"v":2708808,"d":"27.08.8.08"},{"$nulls":9},"CASTANHA DE BABAÇU",null,"#AgroInd116"]
[null,"AL","Satuba","AL - Satuba",{"v":2708907,"d":"27.08.9.07"},{"$nulls":9},"CASTANHA DE CAJU",null,"#AgroInd117"]
[null,"AL","Senador Rui Palmeira","AL - Senador Rui Palmeira",{"v":2708956,"d":"27.08.9.56"},{"$nulls":9},"CASTANHA DO BRASIL",null,"#AgroInd118"]
[null,"AL","Tanque d'Arca","AL - Tanque d'Arca",{"v":2709004,"d":"27.09.0.04"},{"$nulls":9},"CAVALINHA",null,"#AgroInd119"]
[null,"AL","Taquarana","AL - Taquarana",{"v":2709103,"d":"27.09.1.03"},{"$nulls":9},"CEBOLA",null,"#AgroInd120"]
[null,"AL","Teotônio Vilela","AL - Teotônio Vilela",{"v":2709152,"d":"27.09.1.52"},{"$nulls":9},"CEBOLINHA",null,"#AgroInd121"]
[null,"AL","Traipu","AL - Traipu",{"v":2709202,"d":"27.09.2.02"},{"$nulls":9},"CENOURA",null,"#AgroInd122"]
[null,"AL","União dos Palmares","AL - União dos Palmares",{"v":2709301,"d":"27.09.3.01"},{"$nulls":9},"CENTEIO",null,"#AgroInd123"]
[null,"AL","Viçosa","AL - Viçosa",{"v":2709400,"d":"27.09.4.00"},{"$nulls":9},"CERA DE CARNAÚBA",null,"#AgroInd124"]
[null,"AM","Alvarães","AM - Alvarães",{"v":1300029,"d":"13.00.0.29"},{"$nulls":9},"CERVEJA",null,"#AgroInd125"]
[null,"AM","Amaturá","AM - Amaturá",{"v":1300060,"d":"13.00.0.60"},{"$nulls":9},"CEVADA",null,"#AgroInd126"]
[null,"AM","Anamã","AM - Anamã",{"v":1300086,"d":"13.00.0.86"},{"$nulls":9},"CHARUTO",null,"#AgroInd127"]
[null,"AM","Anori","AM - Anori",{"v":1300102,"d":"13.00.1.02"},{"$nulls":9},"CHEIRO VERDE",null,"#AgroInd128"]
[null,"AM","Apuí",{"$f":"CONCATENATE(B131,\" - \",C131)","v":"AM - Apuí"},{"v":1300144,"d":"13.00.1.44"},{"$nulls":9},"CHICHA",null,"#AgroInd129"]
[null,"AM","Atalaia do Norte","AM - Atalaia do Norte",{"v":1300201,"d":"13.00.2.01"},{"$nulls":9},"CHICHA DE MILHO",null,"#AgroInd130"]
[null,"AM","Autazes","AM - Autazes",{"v":1300300,"d":"13.00.3.00"},{"$nulls":9},"CHICÓRIA",null,"#AgroInd131"]
[null,"AM","Barcelos","AM - Barcelos",{"v":1300409,"d":"13.00.4.09"},{"$nulls":9},"CHUCHU",null,"#AgroInd132"]
[null,"AM","Barreirinha","AM - Barreirinha",{"v":1300508,"d":"13.00.5.08"},{"$nulls":9},"CHUCRUTE",null,"#AgroInd133"]
[null,"AM","Benjamin Constant","AM - Benjamin Constant",{"v":1300607,"d":"13.00.6.07"},{"$nulls":9},"CITRUS",null,"#AgroInd134"]
[null,"AM","Beruri","AM - Beruri",{"v":1300631,"d":"13.00.6.31"},{"$nulls":9},"COCO",null,"#AgroInd135"]
[null,"AM","Boa Vista do Ramos","AM - Boa Vista do Ramos",{"v":1300680,"d":"13.00.6.80"},{"$nulls":9},"COCO DE BABAÇU",null,"#AgroInd136"]
[null,"AM","Boca do Acre","AM - Boca do Acre",{"v":1300706,"d":"13.00.7.06"},{"$nulls":9},"COENTRO",null,"#AgroInd137"]
[null,"AM","Borba","AM - Borba",{"v":1300805,"d":"13.00.8.05"},{"$nulls":9},"COGUMELO",null,"#AgroInd138"]
[null,"AM","Caapiranga","AM - Caapiranga",{"v":1300839,"d":"13.00.8.39"},{"$nulls":9},"COMPOTA",null,"#AgroInd139"]
[null,"AM","Canutama","AM - Canutama",{"v":1300904,"d":"13.00.9.04"},{"$nulls":9},"CONSERVA DE HORTALIÇAS",null,"#AgroInd140"]
[null,"AM","Carauari","AM - Carauari",{"v":1301001,"d":"13.01.0.01"},{"$nulls":9},"CONSERVA DE VEGETAIS",null,"#AgroInd141"]
[null,"AM","Careiro","AM - Careiro",{"v":1301100,"d":"13.01.1.00"},{"$nulls":9},"CONSERVA DE VERDURAS",null,"#AgroInd142"]
[null,"AM","Careiro da Várzea","AM - Careiro da Várzea",{"v":1301159,"d":"13.01.1.59"},{"$nulls":9},"COOKIE",null,"#AgroInd143"]
[null,"AM","Coari","AM - Coari",{"v":1301209,"d":"13.01.2.09"},{"$nulls":9},"CORANTE",null,"#AgroInd144"]
[null,"AM","Codajás","AM - Codajás",{"v":1301308,"d":"13.01.3.08"},{"$nulls":9},"CORVINA",null,"#AgroInd145"]
[null,"AM","Eirunepé","AM - Eirunepé",{"v":1301407,"d":"13.01.4.07"},{"$nulls":9},"COUVE",null,"#AgroInd146"]
[null,"AM","Envira","AM - Envira",{"v":1301506,"d":"13.01.5.06"},{"$nulls":9},"COUVE-FLOR",null,"#AgroInd147"]
[null,"AM","Fonte Boa","AM - Fonte Boa",{"v":1301605,"d":"13.01.6.05"},{"$nulls":9},"CRAVO DA ÍNDIA",null,"#AgroInd148"]
[null,"AM","Guajará","AM - Guajará",{"v":1301654,"d":"13.01.6.54"},{"$nulls":9},"CREME DE MILHO",null,"#AgroInd149"]
[null,"AM","Humaitá","AM - Humaitá",{"v":1301704,"d":"13.01.7.04"},{"$nulls":9},"CROQUETE",null,"#AgroInd150"]
[null,"AM","Ipixuna","AM - Ipixuna",{"v":1301803,"d":"13.01.8.03"},{"$nulls":9},"CUBIU",null,"#AgroInd151"]
[null,"AM","Iranduba","AM - Iranduba",{"v":1301852,"d":"13.01.8.52"},{"$nulls":9},"CUCA",null,"#AgroInd152"]
[null,"AM","Itacoatiara","AM - Itacoatiara",{"v":1301902,"d":"13.01.9.02"},{"$nulls":9},"CUIU-CUIU",null,"#AgroInd153"]
[null,"AM","Itamarati","AM - Itamarati",{"v":1301951,"d":"13.01.9.51"},{"$nulls":9},"CUMBEBA",null,"#AgroInd154"]
[null,"AM","Itapiranga","AM - Itapiranga",{"v":1302009,"d":"13.02.0.09"},{"$nulls":9},"CUPUAÇU",null,"#AgroInd155"]
[null,"AM","Japurá","AM - Japurá",{"v":1302108,"d":"13.02.1.08"},{"$nulls":9},"CURIMATÃ",null,"#AgroInd156"]
[null,"AM","Juruá","AM - Juruá",{"v":1302207,"d":"13.02.2.07"},{"$nulls":9},"CURURUCA",null,"#AgroInd157"]
[null,"AM","Jutaí","AM - Jutaí",{"v":1302306,"d":"13.02.3.06"},{"$nulls":9},"CUSCUZ",null,"#AgroInd158"]
[null,"AM","Lábrea","AM - Lábrea",{"v":1302405,"d":"13.02.4.05"},{"$nulls":9},"DOCE",null,"#AgroInd159"]
[null,"AM","Manacapuru","AM - Manacapuru",{"v":1302504,"d":"13.02.5.04"},{"$nulls":9},"DOCE DE ABACAXI",null,"#AgroInd160"]
[null,"AM","Manaquiri","AM - Manaquiri",{"v":1302553,"d":"13.02.5.53"},{"$nulls":9},"DOCE DE ABÓBORA",null,"#AgroInd161"]
[null,"AM","Manaus","AM - Manaus",{"v":1302603,"d":"13.02.6.03"},{"$nulls":9},"DOCE DE ACEROLA",null,"#AgroInd162"]
[null,"AM","Manicoré","AM - Manicoré",{"v":1302702,"d":"13.02.7.02"},{"$nulls":9},"DOCE DE AMENDOIM",null,"#AgroInd163"]
[null,"AM","Maraã","AM - Maraã",{"v":1302801,"d":"13.02.8.01"},{"$nulls":9},"DOCE DE AMORA",null,"#AgroInd164"]
[null,"AM","Maués","AM - Maués",{"v":1302900,"d":"13.02.9.00"},{"$nulls":9},"DOCE DE ARAÇÁ",null,"#AgroInd165"]
[null,"AM","Nhamundá","AM - Nhamundá",{"v":1303007,"d":"13.03.0.07"},{"$nulls":9},"DOCE DE BACURI",null,"#AgroInd166"]
[null,"AM","Nova Olinda do Norte","AM - Nova Olinda do Norte",{"v":1303106,"d":"13.03.1.06"},{"$nulls":9},"DOCE DE BANANA",null,"#AgroInd167"]
[null,"AM","Novo Airão","AM - Novo Airão",{"v":1303205,"d":"13.03.2.05"},{"$nulls":9},"DOCE DE BURITI",null,"#AgroInd168"]
[null,"AM","Novo Aripuanã","AM - Novo Aripuanã",{"v":1303304,"d":"13.03.3.04"},{"$nulls":9},"DOCE DE BUTIÁ",null,"#AgroInd169"]
[null,"AM","Parintins","AM - Parintins",{"v":1303403,"d":"13.03.4.03"},{"$nulls":9},"DOCE DE CAJU",null,"#AgroInd170"]
[null,"AM","Pauini","AM - Pauini",{"v":1303502,"d":"13.03.5.02"},{"$nulls":9},"DOCE DE COCO",null,"#AgroInd171"]
[null,"AM","Presidente Figueiredo","AM - Presidente Figueiredo",{"v":1303536,"d":"13.03.5.36"},{"$nulls":9},"DOCE DE CUPUAÇU",null,"#AgroInd172"]
[null,"AM","Rio Preto da Eva","AM - Rio Preto da Eva",{"v":1303569,"d":"13.03.5.69"},{"$nulls":9},"DOCE DE FIGO",null,"#AgroInd173"]
[null,"AM","Santa Isabel do Rio Negro","AM - Santa Isabel do Rio Negro",{"v":1303601,"d":"13.03.6.01"},{"$nulls":9},"DOCE DE FRUTA",null,"#AgroInd174"]
[null,"AM","Santo Antônio do Içá","AM - Santo Antônio do Içá",{"v":1303700,"d":"13.03.7.00"},{"$nulls":9},"DOCE DE GERGELIM",null,"#AgroInd175"]
[null,"AM","São Gabriel da Cachoeira","AM - São Gabriel da Cachoeira",{"v":1303809,"d":"13.03.8.09"},{"$nulls":9},"DOCE DE GILA",null,"#AgroInd176"]
[null,"AM","São Paulo de Olivença","AM - São Paulo de Olivença",{"v":1303908,"d":"13.03.9.08"},{"$nulls":9},"DOCE DE GOIABA",null,"#AgroInd177"]
[null,"AM","São Sebastião do Uatumã","AM - São Sebastião do Uatumã",{"v":1303957,"d":"13.03.9.57"},{"$nulls":9},"DOCE DE JABOTICABA",null,"#AgroInd178"]
[null,"AM","Silves","AM - Silves",{"v":1304005,"d":"13.04.0.05"},{"$nulls":9},"DOCE DE JENIPAPO",null,"#AgroInd179"]
[null,"AM","Tabatinga","AM - Tabatinga",{"v":1304062,"d":"13.04.0.62"},{"$nulls":9},"DOCE DE LARANJA",null,"#AgroInd180"]
[null,"AM","Tapauá","AM - Tapauá",{"v":1304104,"d":"13.04.1.04"},{"$nulls":9},"DOCE DE LEITE",null,"#AgroInd181"]
[null,"AM","Tefé","AM - Tefé",{"v":1304203,"d":"13.04.2.03"},{"$nulls":9},"DOCE DE LIMÃO",null,"#AgroInd182"]
[null,"AM","Tonantins","AM - Tonantins",{"v":1304237,"d":"13.04.2.37"},{"$nulls":9},"DOCE DE MAÇÃ",null,"#AgroInd183"]
[null,"AM","Uarini","AM - Uarini",{"v":1304260,"d":"13.04.2.60"},{"$nulls":9},"DOCE DE MAMÃO",null,"#AgroInd184"]
[null,"AM","Urucará","AM - Urucará",{"v":1304302,"d":"13.04.3.02"},{"$nulls":9},"DOCE DE MANGA",null,"#AgroInd185"]
[null,"AM","Urucurituba","AM - Urucurituba",{"v":1304401,"d":"13.04.4.01"},{"$nulls":9},"DOCE DE MARACUJÁ",null,"#AgroInd186"]
[null,"AP","Amapá","AP - Amapá",{"v":1600105,"d":"16.00.1.05"},{"$nulls":9},"DOCE DE MARMELO",null,"#AgroInd187"]
[null,"AP","Calçoene","AP - Calçoene",{"v":1600204,"d":"16.00.2.04"},{"$nulls":9},"DOCE DE MORANGO",null,"#AgroInd188"]
[null,"AP","Cutias","AP - Cutias",{"v":1600212,"d":"16.00.2.12"},{"$nulls":9},"DOCE DE SETE CAPOTES",null,"#AgroInd189"]
[null,"AP","Ferreira Gomes","AP - Ferreira Gomes",{"v":1600238,"d":"16.00.2.38"},{"$nulls":9},"DOCE DE TAMARINDO",null,"#AgroInd190"]
[null,"AP","Itaubal","AP - Itaubal",{"v":1600253,"d":"16.00.2.53"},{"$nulls":9},"DOCE DE UMBU",null,"#AgroInd191"]
[null,"AP","Laranjal do Jari","AP - Laranjal do Jari",{"v":1600279,"d":"16.00.2.79"},{"$nulls":9},"DOCE DE UVAIA",null,"#AgroInd192"]
[null,"AP","Macapá",{"$f":"CONCATENATE(B195,\" - \",C195)","v":"AP - Macapá"},{"v":1600303,"d":"16.00.3.03"},{"$nulls":9},"DOURADO",null,"#AgroInd193"]
[null,"AP","Mazagão","AP - Mazagão",{"v":1600402,"d":"16.00.4.02"},{"$nulls":9},"EMBRIÃO BOVINO",null,"#AgroInd194"]
[null,"AP","Oiapoque","AP - Oiapoque",{"v":1600501,"d":"16.00.5.01"},{"$nulls":9},"ENCHOVA",null,"#AgroInd195"]
[null,"AP","Pedra Branca do Amapari","AP - Pedra Branca do Amapari",{"v":1600154,"d":"16.00.1.54"},{"$nulls":9},"ERVA DOCE",null,"#AgroInd196"]
[null,"AP","Porto Grande","AP - Porto Grande",{"v":1600535,"d":"16.00.5.35"},{"$nulls":9},"ERVA MATE",null,"#AgroInd197"]
[null,"AP","Pracuúba","AP - Pracuúba",{"v":1600550,"d":"16.00.5.50"},{"$nulls":9},"ERVILHA",null,"#AgroInd198"]
[null,"AP","Santana","AP - Santana",{"v":1600600,"d":"16.00.6.00"},{"$nulls":9},"ESCAROLA",null,"#AgroInd199"]
[null,"AP","Serra do Navio","AP - Serra do Navio",{"v":1600055,"d":"16.00.0.55"},{"$nulls":9},"ESFIRRA",null,"#AgroInd200"]
[null,"AP","Tartarugalzinho","AP - Tartarugalzinho",{"v":1600709,"d":"16.00.7.09"},{"$nulls":9},"ESPADA"]
[null,"AP","Vitória do Jari","AP - Vitória do Jari",{"v":1600808,"d":"16.00.8.08"},{"$nulls":9},"ESPINAFRE"]
[null,"BA","Abaíra","BA - Abaíra",{"v":2900108,"d":"29.00.1.08"},{"$nulls":9},"EUCALIPTO"]
[null,"BA","Abaré","BA - Abaré",{"v":2900207,"d":"29.00.2.07"},{"$nulls":9},"EXTRATO DE TOMATE"]
[null,"BA","Acajutiba","BA - Acajutiba",{"v":2900306,"d":"29.00.3.06"},{"$nulls":9},"FARELO DE ARROZ"]
[null,"BA","Adustina","BA - Adustina",{"v":2900355,"d":"29.00.3.55"},{"$nulls":9},"FARELO DE MILHO"]
[null,"BA","Água Fria","BA - Água Fria",{"v":2900405,"d":"29.00.4.05"},{"$nulls":9},"FARELO DE SOJA"]
[null,"BA","Aiquara","BA - Aiquara",{"v":2900603,"d":"29.00.6.03"},{"$nulls":9},"FARINHA DE AMENDOIM"]
[null,"BA","Alagoinhas","BA - Alagoinhas",{"v":2900702,"d":"29.00.7.02"},{"$nulls":9},"FARINHA DE BABAÇU"]
[null,"BA","Alcobaça","BA - Alcobaça",{"v":2900801,"d":"29.00.8.01"},{"$nulls":9},"FARINHA DE BANANA"]
[null,"BA","Almadina","BA - Almadina",{"v":2900900,"d":"29.00.9.00"},{"$nulls":9},"FARINHA DE BARU"]
[null,"BA","Amargosa","BA - Amargosa",{"v":2901007,"d":"29.01.0.07"},{"$nulls":9},"FARINHA DE BARY"]
[null,"BA","Amélia Rodrigues","BA - Amélia Rodrigues",{"v":2901106,"d":"29.01.1.06"},{"$nulls":9},"FARINHA DE BOCAIÚVA"]
[null,"BA","América Dourada","BA - América Dourada",{"v":2901155,"d":"29.01.1.55"},{"$nulls":9},"FARINHA DE CACAU"]
[null,"BA","Anagé","BA - Anagé",{"v":2901205,"d":"29.01.2.05"},{"$nulls":9},"FARINHA DE CASTANHA"]
[null,"BA","Andaraí","BA - Andaraí",{"v":2901304,"d":"29.01.3.04"},{"$nulls":9},"FARINHA DE FUBÁ"]
[null,"BA","Andorinha","BA - Andorinha",{"v":2901353,"d":"29.01.3.53"},{"$nulls":9},"FARINHA DE GERGELIM"]
[null,"BA","Angical","BA - Angical",{"v":2901403,"d":"29.01.4.03"},{"$nulls":9},"FARINHA DE GUABIROBA"]
[null,"BA","Anguera","BA - Anguera",{"v":2901502,"d":"29.01.5.02"},{"$nulls":9},"FARINHA DE JATOBÁ"]
[null,"BA","Antas","BA - Antas",{"v":2901601,"d":"29.01.6.01"},{"$nulls":9},"FARINHA DE LINHAÇA DOURADA"]
[null,"BA","Antônio Cardoso","BA - Antônio Cardoso",{"v":2901700,"d":"29.01.7.00"},{"$nulls":9},"FARINHA DE MANDIOCA"]
[null,"BA","Antônio Gonçalves","BA - Antônio Gonçalves",{"v":2901809,"d":"29.01.8.09"},{"$nulls":9},"FARINHA DE MILHO"]
[null,"BA","Aporá","BA - Aporá",{"v":2901908,"d":"29.01.9.08"},{"$nulls":9},"FARINHA DE MORANGA"]
[null,"BA","Apuarema","BA - Apuarema",{"v":2901957,"d":"29.01.9.57"},{"$nulls":9},"FARINHA DE PINHÃO"]
[null,"BA","Araças","BA - Araças",{"v":2902054,"d":"29.02.0.54"},{"$nulls":9},"FARINHA DE SOJA"]
[null,"BA","Aracatu","BA - Aracatu",{"v":2902005,"d":"29.02.0.05"},{"$nulls":9},"FARINHA DE TAPIOCA"]
[null,"BA","Araci","BA - Araci",{"v":2902104,"d":"29.02.1.04"},{"$nulls":9},"FARINHA DE TRIGO"]
[null,"BA","Aramari","BA - Aramari",{"v":2902203,"d":"29.02.2.03"},{"$nulls":9},"FAVA"]
[null,"BA","Arataca","BA - Arataca",{"v":2902252,"d":"29.02.2.52"},{"$nulls":9},"FAVETA"]
[null,"BA","Aratuípe","BA - Aratuípe",{"v":2902302,"d":"29.02.3.02"},{"$nulls":9},"FÉCULA DE MANDIOCA"]
[null,"BA","Aurelino Leal","BA - Aurelino Leal",{"v":2902401,"d":"29.02.4.01"},{"$nulls":9},"FEIJÃO"]
[null,"BA","Baianópolis","BA - Baianópolis",{"v":2902500,"d":"29.02.5.00"},{"$nulls":9},"FIBRA DE CARNAÚBA"]
[null,"BA","Baixa Grande","BA - Baixa Grande",{"v":2902609,"d":"29.02.6.09"},{"$nulls":9},"FIGO"]
[null,"BA","Banzaê","BA - Banzaê",{"v":2902658,"d":"29.02.6.58"},{"$nulls":9},"FLOCOS DE BABAÇU"]
[null,"BA","Barra","BA - Barra",{"v":2902708,"d":"29.02.7.08"},{"$nulls":9},"FLOCOS DE MILHO"]
[null,"BA","Barra da Estiva","BA - Barra da Estiva",{"v":2902807,"d":"29.02.8.07"},{"$nulls":9},"FLORES"]
[null,"BA","Barra do Choça","BA - Barra do Choça",{"v":2902906,"d":"29.02.9.06"},{"$nulls":9},"FRANGO"]
[null,"BA","Barra do Mendes","BA - Barra do Mendes",{"v":2903003,"d":"29.03.0.03"},{"$nulls":9},"FRANGO VIVO"]
[null,"BA","Barra do Rocha","BA - Barra do Rocha",{"v":2903102,"d":"29.03.1.02"},{"$nulls":9},"FRUTA DO CONDE"]
[null,"BA","Barreiras","BA - Barreiras",{"v":2903201,"d":"29.03.2.01"},{"$nulls":9},"FRUTA-PÃO"]
[null,"BA","Barro Alto","BA - Barro Alto",{"v":2903235,"d":"29.03.2.35"},{"$nulls":9},"FUBÁ DE MILHO"]
[null,"BA","Barro Preto","BA - Barro Preto",{"v":2903300,"d":"29.03.3.00"},{"$nulls":9},"FUMO"]
[null,"BA","Barrocas","BA - Barrocas",{"v":2903276,"d":"29.03.2.76"},{"$nulls":9},"GALINHA"]
[null,"BA","Belmonte","BA - Belmonte",{"v":2903409,"d":"29.03.4.09"},{"$nulls":9},"GALINHA CAIPIRA"]
[null,"BA","Belo Campo","BA - Belo Campo",{"v":2903508,"d":"29.03.5.08"},{"$nulls":9},"GEB"]
[null,"BA","Biritinga","BA - Biritinga",{"v":2903607,"d":"29.03.6.07"},{"$nulls":9},"GELÉIA"]
[null,"BA","Boa Nova","BA - Boa Nova",{"v":2903706,"d":"29.03.7.06"},{"$nulls":9},"GENGIBRE"]
[null,"BA","Boa Vista do Tupim","BA - Boa Vista do Tupim",{"v":2903805,"d":"29.03.8.05"},{"$nulls":9},"GERGELIM"]
[null,"BA","Bom Jesus da Lapa","BA - Bom Jesus da Lapa",{"v":2903904,"d":"29.03.9.04"},{"$nulls":9},"GILA"]
[null,"BA","Bom Jesus da Serra","BA - Bom Jesus da Serra",{"v":2903953,"d":"29.03.9.53"},{"$nulls":9},"GIRASSOL"]
[null,"BA","Boninal","BA - Boninal",{"v":2904001,"d":"29.04.0.01"},{"$nulls":9},"GOBO"]
[null,"BA","Bonito","BA - Bonito",{"v":2904050,"d":"29.04.0.50"},{"$nulls":9},"GOIABA"]
[null,"BA","Boquira","BA - Boquira",{"v":2904100,"d":"29.04.1.00"},{"$nulls":9},"GRAMA"]
[null,"BA","Botuporã","BA - Botuporã",{"v":2904209,"d":"29.04.2.09"},{"$nulls":9},"GRANOLA"]
[null,"BA","Brejões","BA - Brejões",{"v":2904308,"d":"29.04.3.08"},{"$nulls":9},"GRAVIOLA"]
[null,"BA","Brejolândia","BA - Brejolândia",{"v":2904407,"d":"29.04.4.07"},{"$nulls":9},"GUABIROBA"]
[null,"BA","Brotas de Macaúbas",{"$f":"CONCATENATE(B259,\" - \",C259)","v":"BA - Brotas de Macaúbas"},{"v":2904506,"d":"29.04.5.06"},{"$nulls":9},"GUAIVIRA"]
[null,"BA","Brumado","BA - Brumado",{"v":2904605,"d":"29.04.6.05"},{"$nulls":9},"GUARAJUBA"]
[null,"BA","Buerarema","BA - Buerarema",{"v":2904704,"d":"29.04.7.04"},{"$nulls":9},"GUARANÁ"]
[null,"BA","Buritirama","BA - Buritirama",{"v":2904753,"d":"29.04.7.53"},{"$nulls":9},"GUARIROBA"]
[null,"BA","Caatiba","BA - Caatiba",{"v":2904803,"d":"29.04.8.03"},{"$nulls":9},"HORTELÃ"]
[null,"BA","Cabaceiras do Paraguaçu","BA - Cabaceiras do Paraguaçu",{"v":2904852,"d":"29.04.8.52"},{"$nulls":9},"INHAME"]
[null,"BA","Cachoeira","BA - Cachoeira",{"v":2904902,"d":"29.04.9.02"},{"$nulls":9},"JABOTICABA"]
[null,"BA","Caculé","BA - Caculé",{"v":2905008,"d":"29.05.0.08"},{"$nulls":9},"JACA"]
[null,"BA","Caém","BA - Caém",{"v":2905107,"d":"29.05.1.07"},{"$nulls":9},"JAMBO"]
[null,"BA","Caetanos","BA - Caetanos",{"v":2905156,"d":"29.05.1.56"},{"$nulls":9},"JAMBU"]
[null,"BA","Caetité","BA - Caetité",{"v":2905206,"d":"29.05.2.06"},{"$nulls":9},"JANDIÁ"]
[null,"BA","Cafarnaum","BA - Cafarnaum",{"v":2905305,"d":"29.05.3.05"},{"$nulls":9},"JARAQUI"]
[null,"BA","Cairu","BA - Cairu",{"v":2905404,"d":"29.05.4.04"},{"$nulls":9},"JATOBÁ"]
[null,"BA","Caldeirão Grande","BA - Caldeirão Grande",{"v":2905503,"d":"29.05.5.03"},{"$nulls":9},"JENIPAPO"]
[null,"BA","Camacan","BA - Camacan",{"v":2905602,"d":"29.05.6.02"},{"$nulls":9},"JILÓ"]
[null,"BA","Camaçari","BA - Camaçari",{"v":2905701,"d":"29.05.7.01"},{"$nulls":9},"JONGOME"]
[null,"BA","Camamu","BA - Camamu",{"v":2905800,"d":"29.05.8.00"},{"$nulls":9},"JUNDIÁ"]
[null,"BA","Campo Alegre de Lourdes","BA - Campo Alegre de Lourdes",{"v":2905909,"d":"29.05.9.09"},{"$nulls":9},"JUTA"]
[null,"BA","Campo Formoso","BA - Campo Formoso",{"v":2906006,"d":"29.06.0.06"},{"$nulls":9},"KIWI"]
[null,"BA","Canápolis","BA - Canápolis",{"v":2906105,"d":"29.06.1.05"},{"$nulls":9},"KOBU"]
[null,"BA","Canarana","BA - Canarana",{"v":2906204,"d":"29.06.2.04"},{"$nulls":9},"KUMAGI"]
[null,"BA","Canavieiras","BA - Canavieiras",{"v":2906303,"d":"29.06.3.03"},{"$nulls":9},"LÃ DE CARNEIRO"]
[null,"BA","Candeal","BA - Candeal",{"v":2906402,"d":"29.06.4.02"},{"$nulls":9},"LAMBARI"]
[null,"BA","Candeias","BA - Candeias",{"v":2906501,"d":"29.06.5.01"},{"$nulls":9},"LARANJA"]
[null,"BA","Candiba","BA - Candiba",{"v":2906600,"d":"29.06.6.00"},{"$nulls":9},"LEITE DE BÚFALA"]
[null,"BA","Cândido Sales","BA - Cândido Sales",{"v":2906709,"d":"29.06.7.09"},{"$nulls":9},"LEITE DE CABRA"]
[null,"BA","Cansanção","BA - Cansanção",{"v":2906808,"d":"29.06.8.08"},{"$nulls":9},"LEITE DE SOJA"]
[null,"BA","Canudos","BA - Canudos",{"v":2906824,"d":"29.06.8.24"},{"$nulls":9},"LEITE DE VACA"]
[null,"BA","Capela do Alto Alegre","BA - Capela do Alto Alegre",{"v":2906857,"d":"29.06.8.57"},{"$nulls":9},"LEITE INDUSTRIALIZADO"]
[null,"BA","Capim Grosso","BA - Capim Grosso",{"v":2906873,"d":"29.06.8.73"},{"$nulls":9},"LICHIA"]
[null,"BA","Caraíbas","BA - Caraíbas",{"v":2906899,"d":"29.06.8.99"},{"$nulls":9},"LICURI"]
[null,"BA","Caravelas","BA - Caravelas",{"v":2906907,"d":"29.06.9.07"},{"$nulls":9},"LIMA"]
[null,"BA","Cardeal da Silva","BA - Cardeal da Silva",{"v":2907004,"d":"29.07.0.04"},{"$nulls":9},"LIMÃO"]
[null,"BA","Carinhanha","BA - Carinhanha",{"v":2907103,"d":"29.07.1.03"},{"$nulls":9},"LINGUADO"]
[null,"BA","Casa Nova","BA - Casa Nova",{"v":2907202,"d":"29.07.2.02"},{"$nulls":9},"LINHAÇA"]
[null,"BA","Castro Alves","BA - Castro Alves",{"v":2907301,"d":"29.07.3.01"},{"$nulls":9},"LIRO"]
[null,"BA","Catolândia","BA - Catolândia",{"v":2907400,"d":"29.07.4.00"},{"$nulls":9},"LOURO"]
[null,"BA","Catu","BA - Catu",{"v":2907509,"d":"29.07.5.09"},{"$nulls":9},"LULA"]
[null,"BA","Caturama","BA - Caturama",{"v":2907558,"d":"29.07.5.58"},{"$nulls":9},"MAÇÃ"]
[null,"BA","Central","BA - Central",{"v":2907608,"d":"29.07.6.08"},{"$nulls":9},"MACARRÃO"]
[null,"BA","Chorrochó","BA - Chorrochó",{"v":2907707,"d":"29.07.7.07"},{"$nulls":9},"MALVA"]
[null,"BA","Cícero Dantas","BA - Cícero Dantas",{"v":2907806,"d":"29.07.8.06"},{"$nulls":9},"MAMÃO"]
[null,"BA","Cipó","BA - Cipó",{"v":2907905,"d":"29.07.9.05"},{"$nulls":9},"MAMONA"]
[null,"BA","Coaraci","BA - Coaraci",{"v":2908002,"d":"29.08.0.02"},{"$nulls":9},"MANÁ"]
[null,"BA","Cocos","BA - Cocos",{"v":2908101,"d":"29.08.1.01"},{"$nulls":9},"MANDI"]
[null,"BA","Conceição da Feira","BA - Conceição da Feira",{"v":2908200,"d":"29.08.2.00"},{"$nulls":9},"MANDIOCA"]
[null,"BA","Conceição do Almeida","BA - Conceição do Almeida",{"v":2908309,"d":"29.08.3.09"},{"$nulls":9},"MANDIOQUINHA"]
[null,"BA","Conceição do Coité","BA - Conceição do Coité",{"v":2908408,"d":"29.08.4.08"},{"$nulls":9},"MANDUBÉ"]
[null,"BA","Conceição do Jacuípe","BA - Conceição do Jacuípe",{"v":2908507,"d":"29.08.5.07"},{"$nulls":9},"MANGA"]
[null,"BA","Conde","BA - Conde",{"v":2908606,"d":"29.08.6.06"},{"$nulls":9},"MANGABA"]
[null,"BA","Condeúba","BA - Condeúba",{"v":2908705,"d":"29.08.7.05"},{"$nulls":9},"MANGALÔ"]
[null,"BA","Contendas do Sincorá","BA - Contendas do Sincorá",{"v":2908804,"d":"29.08.8.04"},{"$nulls":9},"MANGONA"]
[null,"BA","Coração de Maria","BA - Coração de Maria",{"v":2908903,"d":"29.08.9.03"},{"$nulls":9},"MANJUBA"]
[null,"BA","Cordeiros","BA - Cordeiros",{"v":2909000,"d":"29.09.0.00"},{"$nulls":9},"MANTEIGA"]
[null,"BA","Coribe","BA - Coribe",{"v":2909109,"d":"29.09.1.09"},{"$nulls":9},"MAPARÁ"]
[null,"BA","Coronel João Sá","BA - Coronel João Sá",{"v":2909208,"d":"29.09.2.08"},{"$nulls":9},"MARACUJÁ"]
[null,"BA","Correntina","BA - Correntina",{"v":2909307,"d":"29.09.3.07"},{"$nulls":9},"MARI"]
[null,"BA","Cotegipe","BA - Cotegipe",{"v":2909406,"d":"29.09.4.06"},{"$nulls":9},"MARIMBÁ"]
[null,"BA","Cravolândia","BA - Cravolândia",{"v":2909505,"d":"29.09.5.05"},{"$nulls":9},"MARIOLA"]
[null,"BA","Crisópolis","BA - Crisópolis",{"v":2909604,"d":"29.09.6.04"},{"$nulls":9},"MARISCO"]
[null,"BA","Cristópolis","BA - Cristópolis",{"v":2909703,"d":"29.09.7.03"},{"$nulls":9},"MARMELO"]
[null,"BA","Cruz das Almas","BA - Cruz das Almas",{"v":2909802,"d":"29.09.8.02"},{"$nulls":9},"MASSA CASEIRA"]
[null,"BA","Curaçá","BA - Curaçá",{"v":2909901,"d":"29.09.9.01"},{"$nulls":9},"MATRINXÃ"]
[null,"BA","Dário Meira","BA - Dário Meira",{"v":2910008,"d":"29.10.0.08"},{"$nulls":9},"MAXIXE"]
[null,"BA","Dias d'Ávila",{"$f":"CONCATENATE(B323,\" - \",C323)","v":"BA - Dias d'Ávila"},{"v":2910057,"d":"29.10.0.57"},{"$nulls":9},"MEL DE ABELHA"]
[null,"BA","Dom Basílio","BA - Dom Basílio",{"v":2910107,"d":"29.10.1.07"},{"$nulls":9},"MELAÇO"]
[null,"BA","Dom Macedo Costa","BA - Dom Macedo Costa",{"v":2910206,"d":"29.10.2.06"},{"$nulls":9},"MELADO"]
[null,"BA","Elísio Medrado","BA - Elísio Medrado",{"v":2910305,"d":"29.10.3.05"},{"$nulls":9},"MELANCIA"]
[null,"BA","Encruzilhada","BA - Encruzilhada",{"v":2910404,"d":"29.10.4.04"},{"$nulls":9},"MELÃO"]
[null,"BA","Entre Rios","BA - Entre Rios",{"v":2910503,"d":"29.10.5.03"},{"$nulls":9},"MERLUZA"]
[null,"BA","Érico Cardoso","BA - Érico Cardoso",{"v":2900504,"d":"29.00.5.04"},{"$nulls":9},"MESOCARPO EM PÓ"]
[null,"BA","Esplanada","BA - Esplanada",{"v":2910602,"d":"29.10.6.02"},{"$nulls":9},"MEXILHÃO"]
[null,"BA","Euclides da Cunha","BA - Euclides da Cunha",{"v":2910701,"d":"29.10.7.01"},{"$nulls":9},"MILHETO"]
[null,"BA","Eunápolis","BA - Eunápolis",{"v":2910727,"d":"29.10.7.27"},{"$nulls":9},"MILHO"]
[null,"BA","Fátima","BA - Fátima",{"v":2910750,"d":"29.10.7.50"},{"$nulls":9},"MINGAU"]
[null,"BA","Feira da Mata","BA - Feira da Mata",{"v":2910776,"d":"29.10.7.76"},{"$nulls":9},"MIRIM"]
[null,"BA","Feira de Santana","BA - Feira de Santana",{"v":2910800,"d":"29.10.8.00"},{"$nulls":9},"MOLHO DE TOMATE"]
[null,"BA","Filadélfia","BA - Filadélfia",{"v":2910859,"d":"29.10.8.59"},{"$nulls":9},"MORANGA"]
[null,"BA","Firmino Alves","BA - Firmino Alves",{"v":2910909,"d":"29.10.9.09"},{"$nulls":9},"MORANGO"]
[null,"BA","Floresta Azul","BA - Floresta Azul",{"v":2911006,"d":"29.11.0.06"},{"$nulls":9},"MOSCATEX"]
[null,"BA","Formosa do Rio Preto","BA - Formosa do Rio Preto",{"v":2911105,"d":"29.11.1.05"},{"$nulls":9},"MOSTARDA"]
[null,"BA","Gandu","BA - Gandu",{"v":2911204,"d":"29.11.2.04"},{"$nulls":9},"MUAR"]
[null,"BA","Gavião","BA - Gavião",{"v":2911253,"d":"29.11.2.53"},{"$nulls":9},"MURICI"]
[null,"BA","Gentio do Ouro","BA - Gentio do Ouro",{"v":2911303,"d":"29.11.3.03"},{"$nulls":9},"NABO"]
[null,"BA","Glória","BA - Glória",{"v":2911402,"d":"29.11.4.02"},{"$nulls":9},"NATA"]
[null,"BA","Gongogi","BA - Gongogi",{"v":2911501,"d":"29.11.5.01"},{"$nulls":9},"NÉCTAR DE LARANJA"]
[null,"BA","Governador Mangabeira","BA - Governador Mangabeira",{"v":2911600,"d":"29.11.6.00"},{"$nulls":9},"NECTARINA"]
[null,"BA","Guajeru","BA - Guajeru",{"v":2911659,"d":"29.11.6.59"},{"$nulls":9},"NEGO BOM DE BANANA"]
[null,"BA","Guanambi","BA - Guanambi",{"v":2911709,"d":"29.11.7.09"},{"$nulls":9},"NEGO BOM DE GOIABA"]
[null,"BA","Guaratinga","BA - Guaratinga",{"v":2911808,"d":"29.11.8.08"},{"$nulls":9},"NÊSPERA"]
[null,"BA","Heliópolis","BA - Heliópolis",{"v":2911857,"d":"29.11.8.57"},{"$nulls":9},"NOVILHO"]
[null,"BA","Iaçu","BA - Iaçu",{"v":2911907,"d":"29.11.9.07"},{"$nulls":9},"ÓLEO BRUTO"]
[null,"BA","Ibiassucê","BA - Ibiassucê",{"v":2912004,"d":"29.12.0.04"},{"$nulls":9},"ÓLEO DE ANDIROBA"]
[null,"BA","Ibicaraí","BA - Ibicaraí",{"v":2912103,"d":"29.12.1.03"},{"$nulls":9},"ÓLEO DE BABAÇU"]
[null,"BA","Ibicoara","BA - Ibicoara",{"v":2912202,"d":"29.12.2.02"},{"$nulls":9},"ÓLEO DE BURITI"]
[null,"BA","Ibicuí","BA - Ibicuí",{"v":2912301,"d":"29.12.3.01"},{"$nulls":9},"ÓLEO DE COPAÍBA"]
[null,"BA","Ibipeba","BA - Ibipeba",{"v":2912400,"d":"29.12.4.00"},{"$nulls":9},"ÓLEO DE LINHAÇA DOURADA"]
[null,"BA","Ibipitanga","BA - Ibipitanga",{"v":2912509,"d":"29.12.5.09"},{"$nulls":9},"ÓLEO DE PEQUI"]
[null,"BA","Ibiquera","BA - Ibiquera",{"v":2912608,"d":"29.12.6.08"},{"$nulls":9},"ÓLEO ESSENCIAL DE MANDARINA"]
[null,"BA","Ibirapitanga","BA - Ibirapitanga",{"v":2912707,"d":"29.12.7.07"},{"$nulls":9},"ÓLEO NÃO COMESTÍVEL"]
[null,"BA","Ibirapuã","BA - Ibirapuã",{"v":2912806,"d":"29.12.8.06"},{"$nulls":9},"ÓLEO REFINADO"]
[null,"BA","Ibirataia","BA - Ibirataia",{"v":2912905,"d":"29.12.9.05"},{"$nulls":9},"ORA-PRO-NOBIS"]
[null,"BA","Ibitiara","BA - Ibitiara",{"v":2913002,"d":"29.13.0.02"},{"$nulls":9},"ORÉGANO"]
[null,"BA","Ibititá","BA - Ibititá",{"v":2913101,"d":"29.13.1.01"},{"$nulls":9},"OVOS DE CODORNA"]
[null,"BA","Ibotirama","BA - Ibotirama",{"v":2913200,"d":"29.13.2.00"},{"$nulls":9},"OVOS DE GALINHA"]
[null,"BA","Ichu","BA - Ichu",{"v":2913309,"d":"29.13.3.09"},{"$nulls":9},"PAÇOCA"]
[null,"BA","Igaporã","BA - Igaporã",{"v":2913408,"d":"29.13.4.08"},{"$nulls":9},"PACU"]
[null,"BA","Igrapiúna","BA - Igrapiúna",{"v":2913457,"d":"29.13.4.57"},{"$nulls":9},"PALMITO DE PUPUNHA"]
[null,"BA","Iguaí","BA - Iguaí",{"v":2913507,"d":"29.13.5.07"},{"$nulls":9},"PAMITO"]
[null,"BA","Ilhéus","BA - Ilhéus",{"v":2913606,"d":"29.13.6.06"},{"$nulls":9},"PAMONHA"]
[null,"BA","Inhambupe","BA - Inhambupe",{"v":2913705,"d":"29.13.7.05"},{"$nulls":9},"PÃO "]
[null,"BA","Ipecaetá","BA - Ipecaetá",{"v":2913804,"d":"29.13.8.04"},{"$nulls":9},"PAPA TERRA"]
[null,"BA","Ipiaú","BA - Ipiaú",{"v":2913903,"d":"29.13.9.03"},{"$nulls":9},"PARGO"]
[null,"BA","Ipirá","BA - Ipirá",{"v":2914000,"d":"29.14.0.00"},{"$nulls":9},"PASTA DE ALHO"]
[null,"BA","Ipupiara","BA - Ipupiara",{"v":2914109,"d":"29.14.1.09"},{"$nulls":9},"PÉ-DE-MOLEQUE"]
[null,"BA","Irajuba","BA - Irajuba",{"v":2914208,"d":"29.14.2.08"},{"$nulls":9},"PEIXE"]
[null,"BA","Iramaia","BA - Iramaia",{"v":2914307,"d":"29.14.3.07"},{"$nulls":9},"PEIXE ACARÁ"]
[null,"BA","Iraquara","BA - Iraquara",{"v":2914406,"d":"29.14.4.06"},{"$nulls":9},"PEIXE BARBA CHATA"]
[null,"BA","Irará","BA - Irará",{"v":2914505,"d":"29.14.5.05"},{"$nulls":9},"PEIXE BODÓ"]
[null,"BA","Irecê","BA - Irecê",{"v":2914604,"d":"29.14.6.04"},{"$nulls":9},"PEIXE CACHORRINHO"]
[null,"BA","Itabela","BA - Itabela",{"v":2914653,"d":"29.14.6.53"},{"$nulls":9},"PEIXE CARANHA"]
[null,"BA","Itaberaba","BA - Itaberaba",{"v":2914703,"d":"29.14.7.03"},{"$nulls":9},"PEIXE JEJU"]
[null,"BA","Itabuna","BA - Itabuna",{"v":2914802,"d":"29.14.8.02"},{"$nulls":9},"PEIXE PEDRA"]
[null,"BA","Itacaré","BA - Itacaré",{"v":2914901,"d":"29.14.9.01"},{"$nulls":9},"PEIXE PEMBA"]
[null,"BA","Itaeté","BA - Itaeté",{"v":2915007,"d":"29.15.0.07"},{"$nulls":9},"PEIXE PIRANHA"]
[null,"BA","Itagi","BA - Itagi",{"v":2915106,"d":"29.15.1.06"},{"$nulls":9},"PEIXE PIRAPITINGA"]
[null,"BA","Itagibá","BA - Itagibá",{"v":2915205,"d":"29.15.2.05"},{"$nulls":9},"PEIXE PORCO"]
[null,"BA","Itagimirim","BA - Itagimirim",{"v":2915304,"d":"29.15.3.04"},{"$nulls":9},"PEIXE REI"]
[null,"BA","Itaguaçu da Bahia",{"$f":"CONCATENATE(B387,\" - \",C387)","v":"BA - Itaguaçu da Bahia"},{"v":2915353,"d":"29.15.3.53"},{"$nulls":9},"PEIXE SERRA"]
[null,"BA","Itaju do Colônia","BA - Itaju do Colônia",{"v":2915403,"d":"29.15.4.03"},{"$nulls":9},"PEIXE TABAJARA"]
[null,"BA","Itajuípe","BA - Itajuípe",{"v":2915502,"d":"29.15.5.02"},{"$nulls":9},"PEIXE TRILHA"]
[null,"BA","Itamaraju","BA - Itamaraju",{"v":2915601,"d":"29.15.6.01"},{"$nulls":9},"PEIXE TUPI"]
[null,"BA","Itamari","BA - Itamari",{"v":2915700,"d":"29.15.7.00"},{"$nulls":9},"PEIXE URUBARANA"]
[null,"BA","Itambé","BA - Itambé",{"v":2915809,"d":"29.15.8.09"},{"$nulls":9},"PEIXE VIOLINHA"]
[null,"BA","Itanagra","BA - Itanagra",{"v":2915908,"d":"29.15.9.08"},{"$nulls":9},"PEPINO"]
[null,"BA","Itanhém","BA - Itanhém",{"v":2916005,"d":"29.16.0.05"},{"$nulls":9},"PEQUI"]
[null,"BA","Itaparica","BA - Itaparica",{"v":2916104,"d":"29.16.1.04"},{"$nulls":9},"PÊRA"]
[null,"BA","Itapé","BA - Itapé",{"v":2916203,"d":"29.16.2.03"},{"$nulls":9},"PEROÁ"]
[null,"BA","Itapebi","BA - Itapebi",{"v":2916302,"d":"29.16.3.02"},{"$nulls":9},"PERUMBEBA"]
[null,"BA","Itapetinga","BA - Itapetinga",{"v":2916401,"d":"29.16.4.01"},{"$nulls":9},"PESCADA"]
[null,"BA","Itapicuru","BA - Itapicuru",{"v":2916500,"d":"29.16.5.00"},{"$nulls":9},"PESCADINHA"]
[null,"BA","Itapitanga","BA - Itapitanga",{"v":2916609,"d":"29.16.6.09"},{"$nulls":9},"PÊSSEGO"]
[null,"BA","Itaquara","BA - Itaquara",{"v":2916708,"d":"29.16.7.08"},{"$nulls":9},"PÊSSEGO EM LATA"]
[null,"BA","Itarantim","BA - Itarantim",{"v":2916807,"d":"29.16.8.07"},{"$nulls":9},"PÊTA"]
[null,"BA","Itatim","BA - Itatim",{"v":2916856,"d":"29.16.8.56"},{"$nulls":9},"PIAÇAVA"]
[null,"BA","Itiruçu","BA - Itiruçu",{"v":2916906,"d":"29.16.9.06"},{"$nulls":9},"PIAU"]
[null,"BA","Itiúba","BA - Itiúba",{"v":2917003,"d":"29.17.0.03"},{"$nulls":9},"PIAVA"]
[null,"BA","Itororó","BA - Itororó",{"v":2917102,"d":"29.17.1.02"},{"$nulls":9},"PICLES"]
[null,"BA","Ituaçu","BA - Ituaçu",{"v":2917201,"d":"29.17.2.01"},{"$nulls":9},"PIMENTA"]
[null,"BA","Ituberá","BA - Ituberá",{"v":2917300,"d":"29.17.3.00"},{"$nulls":9},"PIMENTA DO REINO"]
[null,"BA","Iuiú","BA - Iuiú",{"v":2917334,"d":"29.17.3.34"},{"$nulls":9},"PIMENTA JIQUITAIA"]
[null,"BA","Jaborandi","BA - Jaborandi",{"v":2917359,"d":"29.17.3.59"},{"$nulls":9},"PIMENTA MOLHO"]
[null,"BA","Jacaraci","BA - Jacaraci",{"v":2917409,"d":"29.17.4.09"},{"$nulls":9},"PIMENTÃO"]
[null,"BA","Jacobina","BA - Jacobina",{"v":2917508,"d":"29.17.5.08"},{"$nulls":9},"PINHA"]
[null,"BA","Jaguaquara","BA - Jaguaquara",{"v":2917607,"d":"29.17.6.07"},{"$nulls":9},"PINHÃO"]
[null,"BA","Jaguarari","BA - Jaguarari",{"v":2917706,"d":"29.17.7.06"},{"$nulls":9},"PINTADO"]
[null,"BA","Jaguaripe","BA - Jaguaripe",{"v":2917805,"d":"29.17.8.05"},{"$nulls":9},"PINTINHO"]
[null,"BA","Jandaíra","BA - Jandaíra",{"v":2917904,"d":"29.17.9.04"},{"$nulls":9},"PINUS"]
[null,"BA","Jequié","BA - Jequié",{"v":2918001,"d":"29.18.0.01"},{"$nulls":9},"PIRAÍBA"]
[null,"BA","Jeremoabo","BA - Jeremoabo",{"v":2918100,"d":"29.18.1.00"},{"$nulls":9},"PIRANDIRA"]
[null,"BA","Jiquiriçá","BA - Jiquiriçá",{"v":2918209,"d":"29.18.2.09"},{"$nulls":9},"PIRARARA"]
[null,"BA","Jitaúna","BA - Jitaúna",{"v":2918308,"d":"29.18.3.08"},{"$nulls":9},"PIRARUCU"]
[null,"BA","João Dourado","BA - João Dourado",{"v":2918357,"d":"29.18.3.57"},{"$nulls":9},"PIRAÚNA"]
[null,"BA","Juazeiro","BA - Juazeiro",{"v":2918407,"d":"29.18.4.07"},{"$nulls":9},"POLENTA"]
[null,"BA","Jucuruçu","BA - Jucuruçu",{"v":2918456,"d":"29.18.4.56"},{"$nulls":9},"POLPA DE ABACAXI"]
[null,"BA","Jussara","BA - Jussara",{"v":2918506,"d":"29.18.5.06"},{"$nulls":9},"POLPA DE AÇAÍ"]
[null,"BA","Jussari","BA - Jussari",{"v":2918555,"d":"29.18.5.55"},{"$nulls":9},"POLPA DE ACEROLA"]
[null,"BA","Jussiape","BA - Jussiape",{"v":2918605,"d":"29.18.6.05"},{"$nulls":9},"POLPA DE AMEIXA"]
[null,"BA","Lafaiete Coutinho","BA - Lafaiete Coutinho",{"v":2918704,"d":"29.18.7.04"},{"$nulls":9},"POLPA DE ARAÇÁ"]
[null,"BA","Lagoa Real","BA - Lagoa Real",{"v":2918753,"d":"29.18.7.53"},{"$nulls":9},"POLPA DE ARATICUM"]
[null,"BA","Laje","BA - Laje",{"v":2918803,"d":"29.18.8.03"},{"$nulls":9},"POLPA DE BACABA"]
[null,"BA","Lajedão","BA - Lajedão",{"v":2918902,"d":"29.18.9.02"},{"$nulls":9},"POLPA DE BACURI"]
[null,"BA","Lajedinho","BA - Lajedinho",{"v":2919009,"d":"29.19.0.09"},{"$nulls":9},"POLPA DE BANANA"]
[null,"BA","Lajedo do Tabocal","BA - Lajedo do Tabocal",{"v":2919058,"d":"29.19.0.58"},{"$nulls":9},"POLPA DE BURITI"]
[null,"BA","Lamarão","BA - Lamarão",{"v":2919108,"d":"29.19.1.08"},{"$nulls":9},"POLPA DE BUTIÁ"]
[null,"BA","Lapão","BA - Lapão",{"v":2919157,"d":"29.19.1.57"},{"$nulls":9},"POLPA DE CACAU"]
[null,"BA","Lauro de Freitas","BA - Lauro de Freitas",{"v":2919207,"d":"29.19.2.07"},{"$nulls":9},"POLPA DE CAGAITA"]
[null,"BA","Lençóis","BA - Lençóis",{"v":2919306,"d":"29.19.3.06"},{"$nulls":9},"POLPA DE CAJÁ"]
[null,"BA","Licínio de Almeida","BA - Licínio de Almeida",{"v":2919405,"d":"29.19.4.05"},{"$nulls":9},"POLPA DE CAJÚ"]
[null,"BA","Livramento de Nossa Senhora","BA - Livramento de Nossa Senhora",{"v":2919504,"d":"29.19.5.04"},{"$nulls":9},"POLPA DE CARAMBOLA"]
[null,"BA","Luís Eduardo Magalhães","BA - Luís Eduardo Magalhães",{"v":2919553,"d":"29.19.5.53"},{"$nulls":9},"POLPA DE CAXI"]
[null,"BA","Macajuba","BA - Macajuba",{"v":2919603,"d":"29.19.6.03"},{"$nulls":9},"POLPA DE CUPUAÇU"]
[null,"BA","Macarani","BA - Macarani",{"v":2919702,"d":"29.19.7.02"},{"$nulls":9},"POLPA DE FRUTAS"]
[null,"BA","Macaúbas","BA - Macaúbas",{"v":2919801,"d":"29.19.8.01"},{"$nulls":9},"POLPA DE GENIPAPO"]
[null,"BA","Macururé","BA - Macururé",{"v":2919900,"d":"29.19.9.00"},{"$nulls":9},"POLPA DE GOIABA"]
[null,"BA","Madre de Deus","BA - Madre de Deus",{"v":2919926,"d":"29.19.9.26"},{"$nulls":9},"POLPA DE GOIABA SERRANA"]
[null,"BA","Maetinga","BA - Maetinga",{"v":2919959,"d":"29.19.9.59"},{"$nulls":9},"POLPA DE GRAVIOLA"]
[null,"BA","Maiquinique","BA - Maiquinique",{"v":2920007,"d":"29.20.0.07"},{"$nulls":9},"POLPA DE GUABIROBA"]
[null,"BA","Mairi","BA - Mairi",{"v":2920106,"d":"29.20.1.06"},{"$nulls":9},"POLPA DE JACA"]
[null,"BA","Malhada","BA - Malhada",{"v":2920205,"d":"29.20.2.05"},{"$nulls":9},"POLPA DE LARANJA"]
[null,"BA","Malhada de Pedras","BA - Malhada de Pedras",{"v":2920304,"d":"29.20.3.04"},{"$nulls":9},"POLPA DE MACAXEIRA"]
[null,"BA","Manoel Vitorino","BA - Manoel Vitorino",{"v":2920403,"d":"29.20.4.03"},{"$nulls":9},"POLPA DE MAMÃO"]
[null,"BA","Mansidão",{"$f":"CONCATENATE(B451,\" - \",C451)","v":"BA - Mansidão"},{"v":2920452,"d":"29.20.4.52"},{"$nulls":9},"POLPA DE MANGA"]
[null,"BA","Maracás","BA - Maracás",{"v":2920502,"d":"29.20.5.02"},{"$nulls":9},"POLPA DE MANGABA"]
[null,"BA","Maragogipe","BA - Maragogipe",{"v":2920601,"d":"29.20.6.01"},{"$nulls":9},"POLPA DE MARACUJÁ"]
[null,"BA","Maraú","BA - Maraú",{"v":2920700,"d":"29.20.7.00"},{"$nulls":9},"POLPA DE MELANCIA"]
[null,"BA","Marcionílio Souza","BA - Marcionílio Souza",{"v":2920809,"d":"29.20.8.09"},{"$nulls":9},"POLPA DE MELÃO"]
[null,"BA","Mascote","BA - Mascote",{"v":2920908,"d":"29.20.9.08"},{"$nulls":9},"POLPA DE MORANGO"]
[null,"BA","Mata de São João","BA - Mata de São João",{"v":2921005,"d":"29.21.0.05"},{"$nulls":9},"POLPA DE MURICI"]
[null,"BA","Matina","BA - Matina",{"v":2921054,"d":"29.21.0.54"},{"$nulls":9},"POLPA DE PATUÁ"]
[null,"BA","Medeiros Neto","BA - Medeiros Neto",{"v":2921104,"d":"29.21.1.04"},{"$nulls":9},"POLPA DE PEIXE"]
[null,"BA","Miguel Calmon","BA - Miguel Calmon",{"v":2921203,"d":"29.21.2.03"},{"$nulls":9},"POLPA DE PEQUI"]
[null,"BA","Milagres","BA - Milagres",{"v":2921302,"d":"29.21.3.02"},{"$nulls":9},"POLPA DE PÊSSEGO"]
[null,"BA","Mirangaba","BA - Mirangaba",{"v":2921401,"d":"29.21.4.01"},{"$nulls":9},"POLPA DE PINHA"]
[null,"BA","Mirante","BA - Mirante",{"v":2921450,"d":"29.21.4.50"},{"$nulls":9},"POLPA DE PITANGA"]
[null,"BA","Monte Santo","BA - Monte Santo",{"v":2921500,"d":"29.21.5.00"},{"$nulls":9},"POLPA DE SAPOTI"]
[null,"BA","Morpará","BA - Morpará",{"v":2921609,"d":"29.21.6.09"},{"$nulls":9},"POLPA DE SERIGUELA"]
[null,"BA","Morro do Chapéu","BA - Morro do Chapéu",{"v":2921708,"d":"29.21.7.08"},{"$nulls":9},"POLPA DE TAMARINDO"]
[null,"BA","Mortugaba","BA - Mortugaba",{"v":2921807,"d":"29.21.8.07"},{"$nulls":9},"POLPA DE TANGERINA"]
[null,"BA","Mucugê","BA - Mucugê",{"v":2921906,"d":"29.21.9.06"},{"$nulls":9},"POLPA DE UMBU"]
[null,"BA","Mucuri","BA - Mucuri",{"v":2922003,"d":"29.22.0.03"},{"$nulls":9},"POLPA DE UMBU-CAJÁ"]
[null,"BA","Mulungu do Morro","BA - Mulungu do Morro",{"v":2922052,"d":"29.22.0.52"},{"$nulls":9},"POLPA DE UVA"]
[null,"BA","Mundo Novo","BA - Mundo Novo",{"v":2922102,"d":"29.22.1.02"},{"$nulls":9},"POLPA DE UVAIA"]
[null,"BA","Muniz Ferreira","BA - Muniz Ferreira",{"v":2922201,"d":"29.22.2.01"},{"$nulls":9},"POLVILHO"]
[null,"BA","Muquém de São Francisco","BA - Muquém de São Francisco",{"v":2922250,"d":"29.22.2.50"},{"$nulls":9},"PRÓPOLIS"]
[null,"BA","Muritiba","BA - Muritiba",{"v":2922300,"d":"29.22.3.00"},{"$nulls":9},"PUPUNHA"]
[null,"BA","Mutuípe","BA - Mutuípe",{"v":2922409,"d":"29.22.4.09"},{"$nulls":9},"QUEIJO"]
[null,"BA","Nazaré","BA - Nazaré",{"v":2922508,"d":"29.22.5.08"},{"$nulls":9},"QUEIJO DE BÚFALA"]
[null,"BA","Nilo Peçanha","BA - Nilo Peçanha",{"v":2922607,"d":"29.22.6.07"},{"$nulls":9},"QUEIJO DE CABRA"]
[null,"BA","Nordestina","BA - Nordestina",{"v":2922656,"d":"29.22.6.56"},{"$nulls":9},"QUIABO"]
[null,"BA","Nova Canaã","BA - Nova Canaã",{"v":2922706,"d":"29.22.7.06"},{"$nulls":9},"QUINCAM"]
[null,"BA","Nova Fátima","BA - Nova Fátima",{"v":2922730,"d":"29.22.7.30"},{"$nulls":9},"QUIRERA DE ARROZ"]
[null,"BA","Nova Ibiá","BA - Nova Ibiá",{"v":2922755,"d":"29.22.7.55"},{"$nulls":9},"QUIRERA DE MILHO"]
[null,"BA","Nova Itarana","BA - Nova Itarana",{"v":2922805,"d":"29.22.8.05"},{"$nulls":9},"RABANETE"]
[null,"BA","Nova Redenção","BA - Nova Redenção",{"v":2922854,"d":"29.22.8.54"},{"$nulls":9},"RADICHE"]
[null,"BA","Nova Soure","BA - Nova Soure",{"v":2922904,"d":"29.22.9.04"},{"$nulls":9},"RAMI"]
[null,"BA","Nova Viçosa","BA - Nova Viçosa",{"v":2923001,"d":"29.23.0.01"},{"$nulls":9},"RAPADURA"]
[null,"BA","Novo Horizonte","BA - Novo Horizonte",{"v":2923035,"d":"29.23.0.35"},{"$nulls":9},"RAPADURINHA"]
[null,"BA","Novo Triunfo","BA - Novo Triunfo",{"v":2923050,"d":"29.23.0.50"},{"$nulls":9},"RASPA DE MANDIOCA"]
[null,"BA","Olindina","BA - Olindina",{"v":2923100,"d":"29.23.1.00"},{"$nulls":9},"REFRIGERANTE"]
[null,"BA","Oliveira dos Brejinhos","BA - Oliveira dos Brejinhos",{"v":2923209,"d":"29.23.2.09"},{"$nulls":9},"REPOLHO"]
[null,"BA","Ouriçangas","BA - Ouriçangas",{"v":2923308,"d":"29.23.3.08"},{"$nulls":9},"REQUEIJÃO"]
[null,"BA","Ourolândia","BA - Ourolândia",{"v":2923357,"d":"29.23.3.57"},{"$nulls":9},"RESINA"]
[null,"BA","Palmas de Monte Alto","BA - Palmas de Monte Alto",{"v":2923407,"d":"29.23.4.07"},{"$nulls":9},"ROBALO"]
[null,"BA","Palmeiras","BA - Palmeiras",{"v":2923506,"d":"29.23.5.06"},{"$nulls":9},"ROMÃ"]
[null,"BA","Paramirim","BA - Paramirim",{"v":2923605,"d":"29.23.6.05"},{"$nulls":9},"ROSADO"]
[null,"BA","Paratinga","BA - Paratinga",{"v":2923704,"d":"29.23.7.04"},{"$nulls":9},"ROSCA"]
[null,"BA","Paripiranga","BA - Paripiranga",{"v":2923803,"d":"29.23.8.03"},{"$nulls":9},"ROSCA DOCE"]
[null,"BA","Pau Brasil","BA - Pau Brasil",{"v":2923902,"d":"29.23.9.02"},{"$nulls":9},"ROSQUINHA"]
[null,"BA","Paulo Afonso","BA - Paulo Afonso",{"v":2924009,"d":"29.24.0.09"},{"$nulls":9},"RÚCULA"]
[null,"BA","Pé de Serra","BA - Pé de Serra",{"v":2924058,"d":"29.24.0.58"},{"$nulls":9},"SAL"]
[null,"BA","Pedrão","BA - Pedrão",{"v":2924108,"d":"29.24.1.08"},{"$nulls":9},"SALADA DE FRUTAS"]
[null,"BA","Pedro Alexandre","BA - Pedro Alexandre",{"v":2924207,"d":"29.24.2.07"},{"$nulls":9},"SALSA"]
[null,"BA","Piatã","BA - Piatã",{"v":2924306,"d":"29.24.3.06"},{"$nulls":9},"SALSÃO"]
[null,"BA","Pilão Arcado","BA - Pilão Arcado",{"v":2924405,"d":"29.24.4.05"},{"$nulls":9},"SALSICHA"]
[null,"BA","Pindaí","BA - Pindaí",{"v":2924504,"d":"29.24.5.04"},{"$nulls":9},"SARAMUNETE"]
[null,"BA","Pindobaçu","BA - Pindobaçu",{"v":2924603,"d":"29.24.6.03"},{"$nulls":9},"SARDA"]
[null,"BA","Pintadas","BA - Pintadas",{"v":2924652,"d":"29.24.6.52"},{"$nulls":9},"SARDINHA"]
[null,"BA","Piraí do Norte","BA - Piraí do Norte",{"v":2924678,"d":"29.24.6.78"},{"$nulls":9},"SCHIMIER"]
[null,"BA","Piripá","BA - Piripá",{"v":2924702,"d":"29.24.7.02"},{"$nulls":9},"SÊMEN"]
[null,"BA","Piritiba","BA - Piritiba",{"v":2924801,"d":"29.24.8.01"},{"$nulls":9},"SEQUILHOS"]
[null,"BA","Planaltino","BA - Planaltino",{"v":2924900,"d":"29.24.9.00"},{"$nulls":9},"SERIGUELA"]
[null,"BA","Planalto","BA - Planalto",{"v":2925006,"d":"29.25.0.06"},{"$nulls":9},"SERRA"]
[null,"BA","Poções","BA - Poções",{"v":2925105,"d":"29.25.1.05"},{"$nulls":9},"SERRALHA"]
[null,"BA","Pojuca","BA - Pojuca",{"v":2925204,"d":"29.25.2.04"},{"$nulls":9},"SETE CAPOTES"]
[null,"BA","Ponto Novo","BA - Ponto Novo",{"v":2925253,"d":"29.25.2.53"},{"$nulls":9},"SISAL"]
[null,"BA","Porto Seguro",{"$f":"CONCATENATE(B515,\" - \",C515)","v":"BA - Porto Seguro"},{"v":2925303,"d":"29.25.3.03"},{"$nulls":9},"SOJA"]
[null,"BA","Potiraguá","BA - Potiraguá",{"v":2925402,"d":"29.25.4.02"},{"$nulls":9},"SOPA KULUXUWA"]
[null,"BA","Prado","BA - Prado",{"v":2925501,"d":"29.25.5.01"},{"$nulls":9},"SORGO GRANÍFERO"]
[null,"BA","Presidente Dutra","BA - Presidente Dutra",{"v":2925600,"d":"29.25.6.00"},{"$nulls":9},"SOROROCA"]
[null,"BA","Presidente Jânio Quadros","BA - Presidente Jânio Quadros",{"v":2925709,"d":"29.25.7.09"},{"$nulls":9},"SUCO"]
[null,"BA","Presidente Tancredo Neves","BA - Presidente Tancredo Neves",{"v":2925758,"d":"29.25.7.58"},{"$nulls":9},"SUÍNO"]
[null,"BA","Queimadas","BA - Queimadas",{"v":2925808,"d":"29.25.8.08"},{"$nulls":9},"SURUBIM"]
[null,"BA","Quijingue","BA - Quijingue",{"v":2925907,"d":"29.25.9.07"},{"$nulls":9},"SURURU"]
[null,"BA","Quixabeira","BA - Quixabeira",{"v":2925931,"d":"29.25.9.31"},{"$nulls":9},"TAIÁ"]
[null,"BA","Rafael Jambeiro","BA - Rafael Jambeiro",{"v":2925956,"d":"29.25.9.56"},{"$nulls":9},"TAINHA"]
[null,"BA","Remanso","BA - Remanso",{"v":2926004,"d":"29.26.0.04"},{"$nulls":9},"TAIOBA"]
[null,"BA","Retirolândia","BA - Retirolândia",{"v":2926103,"d":"29.26.1.03"},{"$nulls":9},"TAMARINDO"]
[null,"BA","Riachão das Neves","BA - Riachão das Neves",{"v":2926202,"d":"29.26.2.02"},{"$nulls":9},"TAMBACÚ"]
[null,"BA","Riachão do Jacuípe","BA - Riachão do Jacuípe",{"v":2926301,"d":"29.26.3.01"},{"$nulls":9},"TAMBAQUI"]
[null,"BA","Riacho de Santana","BA - Riacho de Santana",{"v":2926400,"d":"29.26.4.00"},{"$nulls":9},"TAMBAQUI CURUMIM"]
[null,"BA","Ribeira do Amparo","BA - Ribeira do Amparo",{"v":2926509,"d":"29.26.5.09"},{"$nulls":9},"TAMBICO"]
[null,"BA","Ribeira do Pombal","BA - Ribeira do Pombal",{"v":2926608,"d":"29.26.6.08"},{"$nulls":9},"TAMUATÁ"]
[null,"BA","Ribeirão do Largo","BA - Ribeirão do Largo",{"v":2926657,"d":"29.26.6.57"},{"$nulls":9},"TANGERINA"]
[null,"BA","Rio de Contas","BA - Rio de Contas",{"v":2926707,"d":"29.26.7.07"},{"$nulls":9},"TAPIOCA"]
[null,"BA","Rio do Antônio","BA - Rio do Antônio",{"v":2926806,"d":"29.26.8.06"},{"$nulls":9},"TAPIOCA HARD PELLETS"]
[null,"BA","Rio do Pires","BA - Rio do Pires",{"v":2926905,"d":"29.26.9.05"},{"$nulls":9},"TEMPERO COMPLETO"]
[null,"BA","Rio Real","BA - Rio Real",{"v":2927002,"d":"29.27.0.02"},{"$nulls":9},"TEMPERO NATURAL"]
[null,"BA","Rodelas","BA - Rodelas",{"v":2927101,"d":"29.27.1.01"},{"$nulls":9},"TEMPERO VERDE"]
[null,"BA","Ruy Barbosa","BA - Ruy Barbosa",{"v":2927200,"d":"29.27.2.00"},{"$nulls":9},"TILÁPIA"]
[null,"BA","Salinas da Margarida","BA - Salinas da Margarida",{"v":2927309,"d":"29.27.3.09"},{"$nulls":9},"TOMATE"]
[null,"BA","Salvador","BA - Salvador",{"v":2927408,"d":"29.27.4.08"},{"$nulls":9},"TORTA DE AIPIM"]
[null,"BA","Santa Bárbara","BA - Santa Bárbara",{"v":2927507,"d":"29.27.5.07"},{"$nulls":9},"TORTA DE CENOURA"]
[null,"BA","Santa Brígida","BA - Santa Brígida",{"v":2927606,"d":"29.27.6.06"},{"$nulls":9},"TOUCINHO"]
[null,"BA","Santa Cruz Cabrália","BA - Santa Cruz Cabrália",{"v":2927705,"d":"29.27.7.05"},{"$nulls":9},"TRAÍRA"]
[null,"BA","Santa Cruz da Vitória","BA - Santa Cruz da Vitória",{"v":2927804,"d":"29.27.8.04"},{"$nulls":9},"TRIGO"]
[null,"BA","Santa Inês","BA - Santa Inês",{"v":2927903,"d":"29.27.9.03"},{"$nulls":9},"TRIGO EM GRÃO ESPECIAL"]
[null,"BA","Santa Luzia","BA - Santa Luzia",{"v":2928059,"d":"29.28.0.59"},{"$nulls":9},"TRIGO MOURISCO"]
[null,"BA","Santa Maria da Vitória","BA - Santa Maria da Vitória",{"v":2928109,"d":"29.28.1.09"},{"$nulls":9},"TRIGO SARRACENO"]
[null,"BA","Santa Rita de Cássia","BA - Santa Rita de Cássia",{"v":2928406,"d":"29.28.4.06"},{"$nulls":9},"TRITICALE"]
[null,"BA","Santa Teresinha","BA - Santa Teresinha",{"v":2928505,"d":"29.28.5.05"},{"$nulls":9},"TRUTA"]
[null,"BA","Santaluz","BA - Santaluz",{"v":2928000,"d":"29.28.0.00"},{"$nulls":9},"TUCUMÃ"]
[null,"BA","Santana","BA - Santana",{"v":2928208,"d":"29.28.2.08"},{"$nulls":9},"TUCUNARÉ"]
[null,"BA","Santanópolis","BA - Santanópolis",{"v":2928307,"d":"29.28.3.07"},{"$nulls":9},"UMBU"]
[null,"BA","Santo Amaro","BA - Santo Amaro",{"v":2928604,"d":"29.28.6.04"},{"$nulls":9},"URITINGA"]
[null,"BA","Santo Antônio de Jesus","BA - Santo Antônio de Jesus",{"v":2928703,"d":"29.28.7.03"},{"$nulls":9},"URUCUM"]
[null,"BA","Santo Estêvão","BA - Santo Estêvão",{"v":2928802,"d":"29.28.8.02"},{"$nulls":9},"UVA"]
[null,"BA","São Desidério","BA - São Desidério",{"v":2928901,"d":"29.28.9.01"},{"$nulls":9},"UVAIA"]
[null,"BA","São Domingos","BA - São Domingos",{"v":2928950,"d":"29.28.9.50"},{"$nulls":9},"VACA"]
[null,"BA","São Felipe","BA - São Felipe",{"v":2929107,"d":"29.29.1.07"},{"$nulls":9},"VAGEM"]
[null,"BA","São Félix","BA - São Félix",{"v":2929008,"d":"29.29.0.08"},{"$nulls":9},"VINAGRE"]
[null,"BA","São Félix do Coribe","BA - São Félix do Coribe",{"v":2929057,"d":"29.29.0.57"},{"$nulls":9},"VINAGREIRA"]
[null,"BA","São Francisco do Conde","BA - São Francisco do Conde",{"v":2929206,"d":"29.29.2.06"},{"$nulls":9},"VINHO"]
[null,"BA","São Gabriel","BA - São Gabriel",{"v":2929255,"d":"29.29.2.55"},{"$nulls":9},"VINHO COMUM"]
[null,"BA","São Gonçalo dos Campos","BA - São Gonçalo dos Campos",{"v":2929305,"d":"29.29.3.05"},{"$nulls":9},"VINHO NOBRE"]
[null,"BA","São José da Vitória","BA - São José da Vitória",{"v":2929354,"d":"29.29.3.54"},{"$nulls":9},"VINHO VINÍFERA"]
[null,"BA","São José do Jacuípe","BA - São José do Jacuípe",{"v":2929370,"d":"29.29.3.70"},{"$nulls":9},"VOGA"]
[null,"BA","São Miguel das Matas","BA - São Miguel das Matas",{"v":2929404,"d":"29.29.4.04"},{"$nulls":9},"XAREU"]
[null,"BA","São Sebastião do Passé","BA - São Sebastião do Passé",{"v":2929503,"d":"29.29.5.03"},{"$nulls":9},"XAROPE DE ABACAXI"]
[null,"BA","Sapeaçu","BA - Sapeaçu",{"v":2929602,"d":"29.29.6.02"},{"$nulls":9},"XAROPE DE CUPUAÇU"]
[null,"BA","Sátiro Dias","BA - Sátiro Dias",{"v":2929701,"d":"29.29.7.01"},{"$nulls":9},"XAROPE DE MARACUJÁ"]
[null,"BA","Saubara","BA - Saubara",{"v":2929750,"d":"29.29.7.50"},{"$nulls":9},"XERÉM DE MILHO"]
[null,"BA","Saúde","BA - Saúde",{"v":2929800,"d":"29.29.8.00"},{"$nulls":9},"XIRA"]
[null,"BA","Seabra","BA - Seabra",{"v":2929909,"d":"29.29.9.09"},{"$nulls":9},"#Prod570"]
[null,"BA","Sebastião Laranjeiras","BA - Sebastião Laranjeiras",{"v":2930006,"d":"29.30.0.06"},{"$nulls":9},"#Prod571"]
[null,"BA","Senhor do Bonfim","BA - Senhor do Bonfim",{"v":2930105,"d":"29.30.1.05"},{"$nulls":9},"#Prod572"]
[null,"BA","Sento Sé","BA - Sento Sé",{"v":2930204,"d":"29.30.2.04"},{"$nulls":9},"#Prod573"]
[null,"BA","Serra do Ramalho","BA - Serra do Ramalho",{"v":2930154,"d":"29.30.1.54"},{"$nulls":9},"#Prod574"]
[null,"BA","Serra Dourada","BA - Serra Dourada",{"v":2930303,"d":"29.30.3.03"},{"$nulls":9},"#Prod575"]
[null,"BA","Serra Preta","BA - Serra Preta",{"v":2930402,"d":"29.30.4.02"},{"$nulls":9},"#Prod576"]
[null,"BA","Serrinha",{"$f":"CONCATENATE(B579,\" - \",C579)","v":"BA - Serrinha"},{"v":2930501,"d":"29.30.5.01"},{"$nulls":9},"#Prod577"]
[null,"BA","Serrolândia","BA - Serrolândia",{"v":2930600,"d":"29.30.6.00"},{"$nulls":9},"#Prod578"]
[null,"BA","Simões Filho","BA - Simões Filho",{"v":2930709,"d":"29.30.7.09"},{"$nulls":9},"#Prod579"]
[null,"BA","Sítio do Mato","BA - Sítio do Mato",{"v":2930758,"d":"29.30.7.58"},{"$nulls":9},"#Prod580"]
[null,"BA","Sítio do Quinto","BA - Sítio do Quinto",{"v":2930766,"d":"29.30.7.66"},{"$nulls":9},"#Prod581"]
[null,"BA","Sobradinho","BA - Sobradinho",{"v":2930774,"d":"29.30.7.74"},{"$nulls":9},"#Prod582"]
[null,"BA","Souto Soares","BA - Souto Soares",{"v":2930808,"d":"29.30.8.08"},{"$nulls":9},"#Prod583"]
[null,"BA","Tabocas do Brejo Velho","BA - Tabocas do Brejo Velho",{"v":2930907,"d":"29.30.9.07"},{"$nulls":9},"#Prod584"]
[null,"BA","Tanhaçu","BA - Tanhaçu",{"v":2931004,"d":"29.31.0.04"},{"$nulls":9},"#Prod585"]
[null,"BA","Tanque Novo","BA - Tanque Novo",{"v":2931053,"d":"29.31.0.53"},{"$nulls":9},"#Prod586"]
[null,"BA","Tanquinho","BA - Tanquinho",{"v":2931103,"d":"29.31.1.03"},{"$nulls":9},"#Prod587"]
[null,"BA","Taperoá","BA - Taperoá",{"v":2931202,"d":"29.31.2.02"},{"$nulls":9},"#Prod588"]
[null,"BA","Tapiramutá","BA - Tapiramutá",{"v":2931301,"d":"29.31.3.01"},{"$nulls":9},"#Prod589"]
[null,"BA","Teixeira de Freitas","BA - Teixeira de Freitas",{"v":2931350,"d":"29.31.3.50"},{"$nulls":9},"#Prod590"]
[null,"BA","Teodoro Sampaio","BA - Teodoro Sampaio",{"v":2931400,"d":"29.31.4.00"},{"$nulls":9},"#Prod591"]
[null,"BA","Teofilândia","BA - Teofilândia",{"v":2931509,"d":"29.31.5.09"},{"$nulls":9},"#Prod592"]
[null,"BA","Teolândia","BA - Teolândia",{"v":2931608,"d":"29.31.6.08"},{"$nulls":9},"#Prod593"]
[null,"BA","Terra Nova","BA - Terra Nova",{"v":2931707,"d":"29.31.7.07"},{"$nulls":9},"#Prod594"]
[null,"BA","Tremedal","BA - Tremedal",{"v":2931806,"d":"29.31.8.06"},{"$nulls":9},"#Prod595"]
[null,"BA","Tucano","BA - Tucano",{"v":2931905,"d":"29.31.9.05"},{"$nulls":9},"#Prod596"]
[null,"BA","Uauá","BA - Uauá",{"v":2932002,"d":"29.32.0.02"},{"$nulls":9},"#Prod597"]
[null,"BA","Ubaíra","BA - Ubaíra",{"v":2932101,"d":"29.32.1.01"},{"$nulls":9},"#Prod598"]
[null,"BA","Ubaitaba","BA - Ubaitaba",{"v":2932200,"d":"29.32.2.00"},{"$nulls":9},"#Prod599"]
[null,"BA","Ubatã","BA - Ubatã",{"v":2932309,"d":"29.32.3.09"},{"$nulls":9},"#Prod600"]
[null,"BA","Uibaí","BA - Uibaí",{"v":2932408,"d":"29.32.4.08"},{"$nulls":9},"#Prod601"]
[null,"BA","Umburanas","BA - Umburanas",{"v":2932457,"d":"29.32.4.57"},{"$nulls":9},"#Prod602"]
[null,"BA","Una","BA - Una",{"v":2932507,"d":"29.32.5.07"},{"$nulls":9},"#Prod603"]
[null,"BA","Urandi","BA - Urandi",{"v":2932606,"d":"29.32.6.06"},{"$nulls":9},"#Prod604"]
[null,"BA","Uruçuca","BA - Uruçuca",{"v":2932705,"d":"29.32.7.05"},{"$nulls":9},"#Prod605"]
[null,"BA","Utinga","BA - Utinga",{"v":2932804,"d":"29.32.8.04"},{"$nulls":9},"#Prod606"]
[null,"BA","Valença","BA - Valença",{"v":2932903,"d":"29.32.9.03"},{"$nulls":9},"#Prod607"]
[null,"BA","Valente","BA - Valente",{"v":2933000,"d":"29.33.0.00"},{"$nulls":9},"#Prod608"]
[null,"BA","Várzea da Roça","BA - Várzea da Roça",{"v":2933059,"d":"29.33.0.59"},{"$nulls":9},"#Prod609"]
[null,"BA","Várzea do Poço","BA - Várzea do Poço",{"v":2933109,"d":"29.33.1.09"},{"$nulls":9},"#Prod610"]
[null,"BA","Várzea Nova","BA - Várzea Nova",{"v":2933158,"d":"29.33.1.58"},{"$nulls":9},"#Prod611"]
[null,"BA","Varzedo","BA - Varzedo",{"v":2933174,"d":"29.33.1.74"},{"$nulls":9},"#Prod612"]
[null,"BA","Vera Cruz","BA - Vera Cruz",{"v":2933208,"d":"29.33.2.08"},{"$nulls":9},"#Prod613"]
[null,"BA","Vereda","BA - Vereda",{"v":2933257,"d":"29.33.2.57"},{"$nulls":9},"#Prod614"]
[null,"BA","Vitória da Conquista","BA - Vitória da Conquista",{"v":2933307,"d":"29.33.3.07"},{"$nulls":9},"#Prod615"]
[null,"BA","Wagner","BA - Wagner",{"v":2933406,"d":"29.33.4.06"},{"$nulls":9},"#Prod616"]
[null,"BA","Wanderley","BA - Wanderley",{"v":2933455,"d":"29.33.4.55"},{"$nulls":9},"#Prod617"]
[null,"BA","Wenceslau Guimarães","BA - Wenceslau Guimarães",{"v":2933505,"d":"29.33.5.05"},{"$nulls":9},"#Prod618"]
[null,"BA","Xique-Xique","BA - Xique-Xique",{"v":2933604,"d":"29.33.6.04"},{"$nulls":9},"#Prod619"]
[null,"CE","Abaiara","CE - Abaiara",{"v":2300101,"d":"23.00.1.01"},{"$nulls":9},"#Prod620"]
[null,"CE","Acarape","CE - Acarape",{"v":2300150,"d":"23.00.1.50"},{"$nulls":9},"#Prod621"]
[null,"CE","Acaraú","CE - Acaraú",{"v":2300200,"d":"23.00.2.00"},{"$nulls":9},"#Prod622"]
[null,"CE","Acopiara","CE - Acopiara",{"v":2300309,"d":"23.00.3.09"},{"$nulls":9},"#Prod623"]
[null,"CE","Aiuaba","CE - Aiuaba",{"v":2300408,"d":"23.00.4.08"},{"$nulls":9},"#Prod624"]
[null,"CE","Alcântaras","CE - Alcântaras",{"v":2300507,"d":"23.00.5.07"},{"$nulls":9},"#Prod625"]
[null,"CE","Altaneira","CE - Altaneira",{"v":2300606,"d":"23.00.6.06"},{"$nulls":9},"#Prod626"]
[null,"CE","Alto Santo","CE - Alto Santo",{"v":2300705,"d":"23.00.7.05"},{"$nulls":9},"#Prod627"]
[null,"CE","Amontada","CE - Amontada",{"v":2300754,"d":"23.00.7.54"},{"$nulls":9},"#Prod628"]
[null,"CE","Antonina do Norte","CE - Antonina do Norte",{"v":2300804,"d":"23.00.8.04"},{"$nulls":9},"#Prod629"]
[null,"CE","Apuiarés","CE - Apuiarés",{"v":2300903,"d":"23.00.9.03"},{"$nulls":9},"#Prod630"]
[null,"CE","Aquiraz","CE - Aquiraz",{"v":2301000,"d":"23.01.0.00"},{"$nulls":9},"#Prod631"]
[null,"CE","Aracati","CE - Aracati",{"v":2301109,"d":"23.01.1.09"},{"$nulls":9},"#Prod632"]
[null,"CE","Aracoiaba","CE - Aracoiaba",{"v":2301208,"d":"23.01.2.08"},{"$nulls":9},"#Prod633"]
[null,"CE","Ararendá","CE - Ararendá",{"v":2301257,"d":"23.01.2.57"},{"$nulls":9},"#Prod634"]
[null,"CE","Araripe","CE - Araripe",{"v":2301307,"d":"23.01.3.07"},{"$nulls":9},"#Prod635"]
[null,"CE","Aratuba","CE - Aratuba",{"v":2301406,"d":"23.01.4.06"},{"$nulls":9},"#Prod636"]
[null,"CE","Arneiroz","CE - Arneiroz",{"v":2301505,"d":"23.01.5.05"},{"$nulls":9},"#Prod637"]
[null,"CE","Assaré","CE - Assaré",{"v":2301604,"d":"23.01.6.04"},{"$nulls":9},"#Prod638"]
[null,"CE","Aurora","CE - Aurora",{"v":2301703,"d":"23.01.7.03"},{"$nulls":9},"#Prod639"]
[null,"CE","Baixio","CE - Baixio",{"v":2301802,"d":"23.01.8.02"},{"$nulls":9},"#Prod640"]
[null,"CE","Banabuiú",{"$f":"CONCATENATE(B643,\" - \",C643)","v":"CE - Banabuiú"},{"v":2301851,"d":"23.01.8.51"},{"$nulls":9},"#Prod641"]
[null,"CE","Barbalha","CE - Barbalha",{"v":2301901,"d":"23.01.9.01"},{"$nulls":9},"#Prod642"]
[null,"CE","Barreira","CE - Barreira",{"v":2301950,"d":"23.01.9.50"},{"$nulls":9},"#Prod643"]
[null,"CE","Barro","CE - Barro",{"v":2302008,"d":"23.02.0.08"},{"$nulls":9},"#Prod644"]
[null,"CE","Barroquinha","CE - Barroquinha",{"v":2302057,"d":"23.02.0.57"},{"$nulls":9},"#Prod645"]
[null,"CE","Baturité","CE - Baturité",{"v":2302107,"d":"23.02.1.07"},{"$nulls":9},"#Prod646"]
[null,"CE","Beberibe","CE - Beberibe",{"v":2302206,"d":"23.02.2.06"},{"$nulls":9},"#Prod647"]
[null,"CE","Bela Cruz","CE - Bela Cruz",{"v":2302305,"d":"23.02.3.05"},{"$nulls":9},"#Prod648"]
[null,"CE","Boa Viagem","CE - Boa Viagem",{"v":2302404,"d":"23.02.4.04"},{"$nulls":9},"#Prod649"]
[null,"CE","Brejo Santo","CE - Brejo Santo",{"v":2302503,"d":"23.02.5.03"},{"$nulls":9},"#Prod650"]
[null,"CE","Camocim","CE - Camocim",{"v":2302602,"d":"23.02.6.02"},{"$nulls":9},"#Prod651"]
[null,"CE","Campos Sales","CE - Campos Sales",{"v":2302701,"d":"23.02.7.01"},{"$nulls":9},"#Prod652"]
[null,"CE","Canindé","CE - Canindé",{"v":2302800,"d":"23.02.8.00"},{"$nulls":9},"#Prod653"]
[null,"CE","Capistrano","CE - Capistrano",{"v":2302909,"d":"23.02.9.09"},{"$nulls":9},"#Prod654"]
[null,"CE","Caridade","CE - Caridade",{"v":2303006,"d":"23.03.0.06"},{"$nulls":9},"#Prod655"]
[null,"CE","Cariré","CE - Cariré",{"v":2303105,"d":"23.03.1.05"},{"$nulls":9},"#Prod656"]
[null,"CE","Caririaçu","CE - Caririaçu",{"v":2303204,"d":"23.03.2.04"},{"$nulls":9},"#Prod657"]
[null,"CE","Cariús","CE - Cariús",{"v":2303303,"d":"23.03.3.03"},{"$nulls":9},"#Prod658"]
[null,"CE","Carnaubal","CE - Carnaubal",{"v":2303402,"d":"23.03.4.02"},{"$nulls":9},"#Prod659"]
[null,"CE","Cascavel","CE - Cascavel",{"v":2303501,"d":"23.03.5.01"},{"$nulls":9},"#Prod660"]
[null,"CE","Catarina","CE - Catarina",{"v":2303600,"d":"23.03.6.00"},{"$nulls":9},"#Prod661"]
[null,"CE","Catunda","CE - Catunda",{"v":2303659,"d":"23.03.6.59"},{"$nulls":9},"#Prod662"]
[null,"CE","Caucaia","CE - Caucaia",{"v":2303709,"d":"23.03.7.09"},{"$nulls":9},"#Prod663"]
[null,"CE","Cedro","CE - Cedro",{"v":2303808,"d":"23.03.8.08"},{"$nulls":9},"#Prod664"]
[null,"CE","Chaval","CE - Chaval",{"v":2303907,"d":"23.03.9.07"},{"$nulls":9},"#Prod665"]
[null,"CE","Choró","CE - Choró",{"v":2303931,"d":"23.03.9.31"},{"$nulls":9},"#Prod666"]
[null,"CE","Chorozinho","CE - Chorozinho",{"v":2303956,"d":"23.03.9.56"},{"$nulls":9},"#Prod667"]
[null,"CE","Coreaú","CE - Coreaú",{"v":2304004,"d":"23.04.0.04"},{"$nulls":9},"#Prod668"]
[null,"CE","Crateús","CE - Crateús",{"v":2304103,"d":"23.04.1.03"},{"$nulls":9},"#Prod669"]
[null,"CE","Crato","CE - Crato",{"v":2304202,"d":"23.04.2.02"},{"$nulls":9},"#Prod670"]
[null,"CE","Croatá","CE - Croatá",{"v":2304236,"d":"23.04.2.36"},{"$nulls":9},"#Prod671"]
[null,"CE","Cruz","CE - Cruz",{"v":2304251,"d":"23.04.2.51"},{"$nulls":9},"#Prod672"]
[null,"CE","Deputado Irapuan Pinheiro","CE - Deputado Irapuan Pinheiro",{"v":2304269,"d":"23.04.2.69"},{"$nulls":9},"#Prod673"]
[null,"CE","Ererê","CE - Ererê",{"v":2304277,"d":"23.04.2.77"},{"$nulls":9},"#Prod674"]
[null,"CE","Eusébio","CE - Eusébio",{"v":2304285,"d":"23.04.2.85"},{"$nulls":9},"#Prod675"]
[null,"CE","Farias Brito","CE - Farias Brito",{"v":2304301,"d":"23.04.3.01"},{"$nulls":9},"#Prod676"]
[null,"CE","Forquilha","CE - Forquilha",{"v":2304350,"d":"23.04.3.50"},{"$nulls":9},"#Prod677"]
[null,"CE","Fortaleza","CE - Fortaleza",{"v":2304400,"d":"23.04.4.00"},{"$nulls":9},"#Prod678"]
[null,"CE","Fortim","CE - Fortim",{"v":2304459,"d":"23.04.4.59"},{"$nulls":9},"#Prod679"]
[null,"CE","Frecheirinha","CE - Frecheirinha",{"v":2304509,"d":"23.04.5.09"},{"$nulls":9},"#Prod680"]
[null,"CE","General Sampaio","CE - General Sampaio",{"v":2304608,"d":"23.04.6.08"},{"$nulls":9},"#Prod681"]
[null,"CE","Graça","CE - Graça",{"v":2304657,"d":"23.04.6.57"},{"$nulls":9},"#Prod682"]
[null,"CE","Granja","CE - Granja",{"v":2304707,"d":"23.04.7.07"},{"$nulls":9},"#Prod683"]
[null,"CE","Granjeiro","CE - Granjeiro",{"v":2304806,"d":"23.04.8.06"},{"$nulls":9},"#Prod684"]
[null,"CE","Groaíras","CE - Groaíras",{"v":2304905,"d":"23.04.9.05"},{"$nulls":9},"#Prod685"]
[null,"CE","Guaiúba","CE - Guaiúba",{"v":2304954,"d":"23.04.9.54"},{"$nulls":9},"#Prod686"]
[null,"CE","Guaraciaba do Norte","CE - Guaraciaba do Norte",{"v":2305001,"d":"23.05.0.01"},{"$nulls":9},"#Prod687"]
[null,"CE","Guaramiranga","CE - Guaramiranga",{"v":2305100,"d":"23.05.1.00"},{"$nulls":9},"#Prod688"]
[null,"CE","Hidrolândia","CE - Hidrolândia",{"v":2305209,"d":"23.05.2.09"},{"$nulls":9},"#Prod689"]
[null,"CE","Horizonte","CE - Horizonte",{"v":2305233,"d":"23.05.2.33"},{"$nulls":9},"#Prod690"]
[null,"CE","Ibaretama","CE - Ibaretama",{"v":2305266,"d":"23.05.2.66"},{"$nulls":9},"#Prod691"]
[null,"CE","Ibiapina","CE - Ibiapina",{"v":2305308,"d":"23.05.3.08"},{"$nulls":9},"#Prod692"]
[null,"CE","Ibicuitinga","CE - Ibicuitinga",{"v":2305332,"d":"23.05.3.32"},{"$nulls":9},"#Prod693"]
[null,"CE","Icapuí","CE - Icapuí",{"v":2305357,"d":"23.05.3.57"},{"$nulls":9},"#Prod694"]
[null,"CE","Icó","CE - Icó",{"v":2305407,"d":"23.05.4.07"},{"$nulls":9},"#Prod695"]
[null,"CE","Iguatu","CE - Iguatu",{"v":2305506,"d":"23.05.5.06"},{"$nulls":9},"#Prod696"]
[null,"CE","Independência","CE - Independência",{"v":2305605,"d":"23.05.6.05"},{"$nulls":9},"#Prod697"]
[null,"CE","Ipaporanga","CE - Ipaporanga",{"v":2305654,"d":"23.05.6.54"},{"$nulls":9},"#Prod698"]
[null,"CE","Ipaumirim","CE - Ipaumirim",{"v":2305704,"d":"23.05.7.04"},{"$nulls":9},"#Prod699"]
[null,"CE","Ipu","CE - Ipu",{"v":2305803,"d":"23.05.8.03"},{"$nulls":9},"#Prod700"]
[null,"CE","Ipueiras","CE - Ipueiras",{"v":2305902,"d":"23.05.9.02"},{"$nulls":9},"#Prod701"]
[null,"CE","Iracema","CE - Iracema",{"v":2306009,"d":"23.06.0.09"},{"$nulls":9},"#Prod702"]
[null,"CE","Irauçuba","CE - Irauçuba",{"v":2306108,"d":"23.06.1.08"},{"$nulls":9},"#Prod703"]
[null,"CE","Itaiçaba","CE - Itaiçaba",{"v":2306207,"d":"23.06.2.07"},{"$nulls":9},"#Prod704"]
[null,"CE","Itaitinga",{"$f":"CONCATENATE(B707,\" - \",C707)","v":"CE - Itaitinga"},{"v":2306256,"d":"23.06.2.56"},{"$nulls":9},"#Prod705"]
[null,"CE","Itapagé","CE - Itapagé",{"v":2306306,"d":"23.06.3.06"},{"$nulls":9},"#Prod706"]
[null,"CE","Itapipoca","CE - Itapipoca",{"v":2306405,"d":"23.06.4.05"},{"$nulls":9},"#Prod707"]
[null,"CE","Itapiúna","CE - Itapiúna",{"v":2306504,"d":"23.06.5.04"},{"$nulls":9},"#Prod708"]
[null,"CE","Itarema","CE - Itarema",{"v":2306553,"d":"23.06.5.53"},{"$nulls":9},"#Prod709"]
[null,"CE","Itatira","CE - Itatira",{"v":2306603,"d":"23.06.6.03"},{"$nulls":9},"#Prod710"]
[null,"CE","Jaguaretama","CE - Jaguaretama",{"v":2306702,"d":"23.06.7.02"},{"$nulls":9},"#Prod711"]
[null,"CE","Jaguaribara","CE - Jaguaribara",{"v":2306801,"d":"23.06.8.01"},{"$nulls":9},"#Prod712"]
[null,"CE","Jaguaribe","CE - Jaguaribe",{"v":2306900,"d":"23.06.9.00"},{"$nulls":9},"#Prod713"]
[null,"CE","Jaguaruana","CE - Jaguaruana",{"v":2307007,"d":"23.07.0.07"},{"$nulls":9},"#Prod714"]
[null,"CE","Jardim","CE - Jardim",{"v":2307106,"d":"23.07.1.06"},{"$nulls":9},"#Prod715"]
[null,"CE","Jati","CE - Jati",{"v":2307205,"d":"23.07.2.05"},{"$nulls":9},"#Prod716"]
[null,"CE","Jijoca de Jericoacoara","CE - Jijoca de Jericoacoara",{"v":2307254,"d":"23.07.2.54"},{"$nulls":9},"#Prod717"]
[null,"CE","Juazeiro do Norte","CE - Juazeiro do Norte",{"v":2307304,"d":"23.07.3.04"},{"$nulls":9},"#Prod718"]
[null,"CE","Jucás","CE - Jucás",{"v":2307403,"d":"23.07.4.03"},{"$nulls":9},"#Prod719"]
[null,"CE","Lavras da Mangabeira","CE - Lavras da Mangabeira",{"v":2307502,"d":"23.07.5.02"},{"$nulls":9},"#Prod720"]
[null,"CE","Limoeiro do Norte","CE - Limoeiro do Norte",{"v":2307601,"d":"23.07.6.01"},{"$nulls":9},"#Prod721"]
[null,"CE","Madalena","CE - Madalena",{"v":2307635,"d":"23.07.6.35"},{"$nulls":9},"#Prod722"]
[null,"CE","Maracanaú","CE - Maracanaú",{"v":2307650,"d":"23.07.6.50"},{"$nulls":9},"#Prod723"]
[null,"CE","Maranguape","CE - Maranguape",{"v":2307700,"d":"23.07.7.00"},{"$nulls":9},"#Prod724"]
[null,"CE","Marco","CE - Marco",{"v":2307809,"d":"23.07.8.09"},{"$nulls":9},"#Prod725"]
[null,"CE","Martinópole","CE - Martinópole",{"v":2307908,"d":"23.07.9.08"},{"$nulls":9},"#Prod726"]
[null,"CE","Massapê","CE - Massapê",{"v":2308005,"d":"23.08.0.05"},{"$nulls":9},"#Prod727"]
[null,"CE","Mauriti","CE - Mauriti",{"v":2308104,"d":"23.08.1.04"},{"$nulls":9},"#Prod728"]
[null,"CE","Meruoca","CE - Meruoca",{"v":2308203,"d":"23.08.2.03"},{"$nulls":9},"#Prod729"]
[null,"CE","Milagres","CE - Milagres",{"v":2308302,"d":"23.08.3.02"},{"$nulls":9},"#Prod730"]
[null,"CE","Milhã","CE - Milhã",{"v":2308351,"d":"23.08.3.51"},{"$nulls":9},"#Prod731"]
[null,"CE","Miraíma","CE - Miraíma",{"v":2308377,"d":"23.08.3.77"},{"$nulls":9},"#Prod732"]
[null,"CE","Missão Velha","CE - Missão Velha",{"v":2308401,"d":"23.08.4.01"},{"$nulls":9},"#Prod733"]
[null,"CE","Mombaça","CE - Mombaça",{"v":2308500,"d":"23.08.5.00"},{"$nulls":9},"#Prod734"]
[null,"CE","Monsenhor Tabosa","CE - Monsenhor Tabosa",{"v":2308609,"d":"23.08.6.09"},{"$nulls":9},"#Prod735"]
[null,"CE","Morada Nova","CE - Morada Nova",{"v":2308708,"d":"23.08.7.08"},{"$nulls":9},"#Prod736"]
[null,"CE","Moraújo","CE - Moraújo",{"v":2308807,"d":"23.08.8.07"},{"$nulls":9},"#Prod737"]
[null,"CE","Morrinhos","CE - Morrinhos",{"v":2308906,"d":"23.08.9.06"},{"$nulls":9},"#Prod738"]
[null,"CE","Mucambo","CE - Mucambo",{"v":2309003,"d":"23.09.0.03"},{"$nulls":9},"#Prod739"]
[null,"CE","Mulungu","CE - Mulungu",{"v":2309102,"d":"23.09.1.02"},{"$nulls":9},"#Prod740"]
[null,"CE","Nova Olinda","CE - Nova Olinda",{"v":2309201,"d":"23.09.2.01"},{"$nulls":9},"#Prod741"]
[null,"CE","Nova Russas","CE - Nova Russas",{"v":2309300,"d":"23.09.3.00"},{"$nulls":9},"#Prod742"]
[null,"CE","Novo Oriente","CE - Novo Oriente",{"v":2309409,"d":"23.09.4.09"},{"$nulls":9},"#Prod743"]
[null,"CE","Ocara","CE - Ocara",{"v":2309458,"d":"23.09.4.58"},{"$nulls":9},"#Prod744"]
[null,"CE","Orós","CE - Orós",{"v":2309508,"d":"23.09.5.08"},{"$nulls":9},"#Prod745"]
[null,"CE","Pacajus","CE - Pacajus",{"v":2309607,"d":"23.09.6.07"},{"$nulls":9},"#Prod746"]
[null,"CE","Pacatuba","CE - Pacatuba",{"v":2309706,"d":"23.09.7.06"},{"$nulls":9},"#Prod747"]
[null,"CE","Pacoti","CE - Pacoti",{"v":2309805,"d":"23.09.8.05"},{"$nulls":9},"#Prod748"]
[null,"CE","Pacujá","CE - Pacujá",{"v":2309904,"d":"23.09.9.04"},{"$nulls":9},"#Prod749"]
[null,"CE","Palhano","CE - Palhano",{"v":2310001,"d":"23.10.0.01"},{"$nulls":9},"#Prod750"]
[null,"CE","Palmácia","CE - Palmácia",{"v":2310100,"d":"23.10.1.00"},{"$nulls":9},"#Prod751"]
[null,"CE","Paracuru","CE - Paracuru",{"v":2310209,"d":"23.10.2.09"},{"$nulls":9},"#Prod752"]
[null,"CE","Paraipaba","CE - Paraipaba",{"v":2310258,"d":"23.10.2.58"},{"$nulls":9},"#Prod753"]
[null,"CE","Parambu","CE - Parambu",{"v":2310308,"d":"23.10.3.08"},{"$nulls":9},"#Prod754"]
[null,"CE","Paramoti","CE - Paramoti",{"v":2310407,"d":"23.10.4.07"},{"$nulls":9},"#Prod755"]
[null,"CE","Pedra Branca","CE - Pedra Branca",{"v":2310506,"d":"23.10.5.06"},{"$nulls":9},"#Prod756"]
[null,"CE","Penaforte","CE - Penaforte",{"v":2310605,"d":"23.10.6.05"},{"$nulls":9},"#Prod757"]
[null,"CE","Pentecoste","CE - Pentecoste",{"v":2310704,"d":"23.10.7.04"},{"$nulls":9},"#Prod758"]
[null,"CE","Pereiro","CE - Pereiro",{"v":2310803,"d":"23.10.8.03"},{"$nulls":9},"#Prod759"]
[null,"CE","Pindoretama","CE - Pindoretama",{"v":2310852,"d":"23.10.8.52"},{"$nulls":9},"#Prod760"]
[null,"CE","Piquet Carneiro","CE - Piquet Carneiro",{"v":2310902,"d":"23.10.9.02"},{"$nulls":9},"#Prod761"]
[null,"CE","Pires Ferreira","CE - Pires Ferreira",{"v":2310951,"d":"23.10.9.51"},{"$nulls":9},"#Prod762"]
[null,"CE","Poranga","CE - Poranga",{"v":2311009,"d":"23.11.0.09"},{"$nulls":9},"#Prod763"]
[null,"CE","Porteiras","CE - Porteiras",{"v":2311108,"d":"23.11.1.08"},{"$nulls":9},"#Prod764"]
[null,"CE","Potengi","CE - Potengi",{"v":2311207,"d":"23.11.2.07"},{"$nulls":9},"#Prod765"]
[null,"CE","Potiretama","CE - Potiretama",{"v":2311231,"d":"23.11.2.31"},{"$nulls":9},"#Prod766"]
[null,"CE","Quiterianópolis","CE - Quiterianópolis",{"v":2311264,"d":"23.11.2.64"},{"$nulls":9},"#Prod767"]
[null,"CE","Quixadá","CE - Quixadá",{"v":2311306,"d":"23.11.3.06"},{"$nulls":9},"#Prod768"]
[null,"CE","Quixelô",{"$f":"CONCATENATE(B771,\" - \",C771)","v":"CE - Quixelô"},{"v":2311355,"d":"23.11.3.55"},{"$nulls":9},"#Prod769"]
[null,"CE","Quixeramobim","CE - Quixeramobim",{"v":2311405,"d":"23.11.4.05"},{"$nulls":9},"#Prod770"]
[null,"CE","Quixeré","CE - Quixeré",{"v":2311504,"d":"23.11.5.04"},{"$nulls":9},"#Prod771"]
[null,"CE","Redenção","CE - Redenção",{"v":2311603,"d":"23.11.6.03"},{"$nulls":9},"#Prod772"]
[null,"CE","Reriutaba","CE - Reriutaba",{"v":2311702,"d":"23.11.7.02"},{"$nulls":9},"#Prod773"]
[null,"CE","Russas","CE - Russas",{"v":2311801,"d":"23.11.8.01"},{"$nulls":9},"#Prod774"]
[null,"CE","Saboeiro","CE - Saboeiro",{"v":2311900,"d":"23.11.9.00"},{"$nulls":9},"#Prod775"]
[null,"CE","Salitre","CE - Salitre",{"v":2311959,"d":"23.11.9.59"},{"$nulls":9},"#Prod776"]
[null,"CE","Santa Quitéria","CE - Santa Quitéria",{"v":2312205,"d":"23.12.2.05"},{"$nulls":9},"#Prod777"]
[null,"CE","Santana do Acaraú","CE - Santana do Acaraú",{"v":2312007,"d":"23.12.0.07"},{"$nulls":9},"#Prod778"]
[null,"CE","Santana do Cariri","CE - Santana do Cariri",{"v":2312106,"d":"23.12.1.06"},{"$nulls":9},"#Prod779"]
[null,"CE","São Benedito","CE - São Benedito",{"v":2312304,"d":"23.12.3.04"},{"$nulls":9},"#Prod780"]
[null,"CE","São Gonçalo do Amarante","CE - São Gonçalo do Amarante",{"v":2312403,"d":"23.12.4.03"},{"$nulls":9},"#Prod781"]
[null,"CE","São João do Jaguaribe","CE - São João do Jaguaribe",{"v":2312502,"d":"23.12.5.02"},{"$nulls":9},"#Prod782"]
[null,"CE","São Luís do Curu","CE - São Luís do Curu",{"v":2312601,"d":"23.12.6.01"},{"$nulls":9},"#Prod783"]
[null,"CE","Senador Pompeu","CE - Senador Pompeu",{"v":2312700,"d":"23.12.7.00"},{"$nulls":9},"#Prod784"]
[null,"CE","Senador Sá","CE - Senador Sá",{"v":2312809,"d":"23.12.8.09"},{"$nulls":9},"#Prod785"]
[null,"CE","Sobral","CE - Sobral",{"v":2312908,"d":"23.12.9.08"},{"$nulls":9},"#Prod786"]
[null,"CE","Solonópole","CE - Solonópole",{"v":2313005,"d":"23.13.0.05"},{"$nulls":9},"#Prod787"]
[null,"CE","Tabuleiro do Norte","CE - Tabuleiro do Norte",{"v":2313104,"d":"23.13.1.04"},{"$nulls":9},"#Prod788"]
[null,"CE","Tamboril","CE - Tamboril",{"v":2313203,"d":"23.13.2.03"},{"$nulls":9},"#Prod789"]
[null,"CE","Tarrafas","CE - Tarrafas",{"v":2313252,"d":"23.13.2.52"},{"$nulls":9},"#Prod790"]
[null,"CE","Tauá","CE - Tauá",{"v":2313302,"d":"23.13.3.02"},{"$nulls":9},"#Prod791"]
[null,"CE","Tejuçuoca","CE - Tejuçuoca",{"v":2313351,"d":"23.13.3.51"},{"$nulls":9},"#Prod792"]
[null,"CE","Tianguá","CE - Tianguá",{"v":2313401,"d":"23.13.4.01"},{"$nulls":9},"#Prod793"]
[null,"CE","Trairi","CE - Trairi",{"v":2313500,"d":"23.13.5.00"},{"$nulls":9},"#Prod794"]
[null,"CE","Tururu","CE - Tururu",{"v":2313559,"d":"23.13.5.59"},{"$nulls":9},"#Prod795"]
[null,"CE","Ubajara","CE - Ubajara",{"v":2313609,"d":"23.13.6.09"},{"$nulls":9},"#Prod796"]
[null,"CE","Umari",{"$f":"CONCATENATE(B799,\" - \",C799)","v":"CE - Umari"},{"v":2313708,"d":"23.13.7.08"},{"$nulls":9},"#Prod797"]
[null,"CE","Umirim","CE - Umirim",{"v":2313757,"d":"23.13.7.57"},{"$nulls":9},"#Prod798"]
[null,"CE","Uruburetama","CE - Uruburetama",{"v":2313807,"d":"23.13.8.07"},{"$nulls":9},"#Prod799"]
[null,"CE","Uruoca","CE - Uruoca",{"v":2313906,"d":"23.13.9.06"},{"$nulls":9},"#Prod800"]
[null,"CE","Varjota","CE - Varjota",{"v":2313955,"d":"23.13.9.55"}]
[null,"CE","Várzea Alegre","CE - Várzea Alegre",{"v":2314003,"d":"23.14.0.03"}]
[null,"CE","Viçosa do Ceará","CE - Viçosa do Ceará",{"v":2314102,"d":"23.14.1.02"}]
[null,"DF","Brasília","DF - Brasília",{"v":5300108,"d":"53.00.1.08"}]
[null,"DF","Águas Claras","DF - Águas Claras",{"v":5300108,"d":"53.00.1.08"}]
[null,"DF","Brazlândia","DF - Brazlândia",{"v":5300108,"d":"53.00.1.08"}]
[null,"DF","Candangolândia","DF - Candangolândia",{"v":5300108,"d":"53.00.1.08"}]
[null,"DF","Ceilândia","DF - Ceilândia",{"v":5300108,"d":"53.00.1.08"}]
[null,"DF","Cruzeiro","DF - Cruzeiro",{"v":5300108,"d":"53.00.1.08"}]
[null,"DF","Fercal","DF - Fercal",{"v":5300108,"d":"53.00.1.08"}]
[null,"DF","Gama","DF - Gama",{"v":5300108,"d":"53.00.1.08"}]
[null,"DF","Guará","DF - Guará",{"v":5300108,"d":"53.00.1.08"}]
[null,"DF","Itapoã","DF - Itapoã",{"v":5300108,"d":"53.00.1.08"}]
[null,"DF","Jardim Botânico","DF - Jardim Botânico",{"v":5300108,"d":"53.00.1.08"}]
[null,"DF","Lago Norte","DF - Lago Norte",{"v":5300108,"d":"53.00.1.08"}]
[null,"DF","Lago Sul","DF - Lago Sul",{"v":5300108,"d":"53.00.1.08"}]
[null,"DF","Núcleo Bandeirante","DF - Núcleo Bandeirante",{"v":5300108,"d":"53.00.1.08"}]
[null,"DF","Octogonal","DF - Octogonal",{"v":5300108,"d":"53.00.1.08"}]
[null,"DF","Paranoá","DF - Paranoá",{"v":5300108,"d":"53.00.1.08"}]
[null,"DF","Park Way","DF - Park Way",{"v":5300108,"d":"53.00.1.08"}]
[null,"DF","Planaltina","DF - Planaltina",{"v":5300108,"d":"53.00.1.08"}]
[null,"DF","Plano Piloto","DF - Plano Piloto",{"v":5300108,"d":"53.00.1.08"}]
[null,"DF","Recanto das Emas","DF - Recanto das Emas",{"v":5300108,"d":"53.00.1.08"}]
[null,"DF","Riacho Fundo I","DF - Riacho Fundo I",{"v":5300108,"d":"53.00.1.08"}]
[null,"DF","Riacho Fundo II","DF - Riacho Fundo II",{"v":5300108,"d":"53.00.1.08"}]
[null,"DF","Samambaia","DF - Samambaia",{"v":5300108,"d":"53.00.1.08"}]
[null,"DF","Santa Maria","DF - Santa Maria",{"v":5300108,"d":"53.00.1.08"}]
[null,"DF","São Sebastião","DF - São Sebastião",{"v":5300108,"d":"53.00.1.08"}]
[null,"DF","SCIA","DF - SCIA",{"v":5300108,"d":"53.00.1.08"}]
[null,"DF","SIA","DF - SIA",{"v":5300108,"d":"53.00.1.08"}]
[null,"DF","Sobradinho I","DF - Sobradinho I",{"v":5300108,"d":"53.00.1.08"}]
[null,"DF","Sobradinho II","DF - Sobradinho II",{"v":5300108,"d":"53.00.1.08"}]
[null,"DF","Sudoeste","DF - Sudoeste",{"v":5300108,"d":"53.00.1.08"}]
[null,"DF","Taguatinga","DF - Taguatinga",{"v":5300108,"d":"53.00.1.08"}]
[null,"DF","Varjão","DF - Varjão",{"v":5300108,"d":"53.00.1.08"}]
[null,"DF","Vicente Pires","DF - Vicente Pires",{"v":5300108,"d":"53.00.1.08"}]
[null,"ES","Afonso Cláudio","ES - Afonso Cláudio",{"v":3200102,"d":"32.00.1.02"}]
[null,"ES","Água Doce do Norte","ES - Água Doce do Norte",{"v":3200169,"d":"32.00.1.69"}]
[null,"ES","Águia Branca","ES - Águia Branca",{"v":3200136,"d":"32.00.1.36"}]
[null,"ES","Alegre","ES - Alegre",{"v":3200201,"d":"32.00.2.01"}]
[null,"ES","Alfredo Chaves","ES - Alfredo Chaves",{"v":3200300,"d":"32.00.3.00"}]
[null,"ES","Alto Rio Novo","ES - Alto Rio Novo",{"v":3200359,"d":"32.00.3.59"}]
[null,"ES","Anchieta","ES - Anchieta",{"v":3200409,"d":"32.00.4.09"}]
[null,"ES","Apiacá","ES - Apiacá",{"v":3200508,"d":"32.00.5.08"}]
[null,"ES","Aracruz","ES - Aracruz",{"v":3200607,"d":"32.00.6.07"}]
[null,"ES","Atilio Vivacqua","ES - Atilio Vivacqua",{"v":3200706,"d":"32.00.7.06"}]
[null,"ES","Baixo Guandu","ES - Baixo Guandu",{"v":3200805,"d":"32.00.8.05"}]
[null,"ES","Barra de São Francisco","ES - Barra de São Francisco",{"v":3200904,"d":"32.00.9.04"}]
[null,"ES","Boa Esperança","ES - Boa Esperança",{"v":3201001,"d":"32.01.0.01"}]
[null,"ES","Bom Jesus do Norte","ES - Bom Jesus do Norte",{"v":3201100,"d":"32.01.1.00"}]
[null,"ES","Brejetuba","ES - Brejetuba",{"v":3201159,"d":"32.01.1.59"}]
[null,"ES","Cachoeiro de Itapemirim","ES - Cachoeiro de Itapemirim",{"v":3201209,"d":"32.01.2.09"}]
[null,"ES","Cariacica","ES - Cariacica",{"v":3201308,"d":"32.01.3.08"}]
[null,"ES","Castelo","ES - Castelo",{"v":3201407,"d":"32.01.4.07"}]
[null,"ES","Colatina","ES - Colatina",{"v":3201506,"d":"32.01.5.06"}]
[null,"ES","Conceição da Barra","ES - Conceição da Barra",{"v":3201605,"d":"32.01.6.05"}]
[null,"ES","Conceição do Castelo","ES - Conceição do Castelo",{"v":3201704,"d":"32.01.7.04"}]
[null,"ES","Divino de São Lourenço","ES - Divino de São Lourenço",{"v":3201803,"d":"32.01.8.03"}]
[null,"ES","Domingos Martins","ES - Domingos Martins",{"v":3201902,"d":"32.01.9.02"}]
[null,"ES","Dores do Rio Preto","ES - Dores do Rio Preto",{"v":3202009,"d":"32.02.0.09"}]
[null,"ES","Ecoporanga",{"$f":"CONCATENATE(B863,\" - \",C863)","v":"ES - Ecoporanga"},{"v":3202108,"d":"32.02.1.08"}]
[null,"ES","Fundão","ES - Fundão",{"v":3202207,"d":"32.02.2.07"}]
[null,"ES","Governador Lindenberg","ES - Governador Lindenberg",{"v":3202256,"d":"32.02.2.56"}]
[null,"ES","Guaçuí","ES - Guaçuí",{"v":3202306,"d":"32.02.3.06"}]
[null,"ES","Guarapari","ES - Guarapari",{"v":3202405,"d":"32.02.4.05"}]
[null,"ES","Ibatiba","ES - Ibatiba",{"v":3202454,"d":"32.02.4.54"}]
[null,"ES","Ibiraçu","ES - Ibiraçu",{"v":3202504,"d":"32.02.5.04"}]
[null,"ES","Ibitirama","ES - Ibitirama",{"v":3202553,"d":"32.02.5.53"}]
[null,"ES","Iconha","ES - Iconha",{"v":3202603,"d":"32.02.6.03"}]
[null,"ES","Irupi","ES - Irupi",{"v":3202652,"d":"32.02.6.52"}]
[null,"ES","Itaguaçu","ES - Itaguaçu",{"v":3202702,"d":"32.02.7.02"}]
[null,"ES","Itapemirim","ES - Itapemirim",{"v":3202801,"d":"32.02.8.01"}]
[null,"ES","Itarana","ES - Itarana",{"v":3202900,"d":"32.02.9.00"}]
[null,"ES","Iúna","ES - Iúna",{"v":3203007,"d":"32.03.0.07"}]
[null,"ES","Jaguaré","ES - Jaguaré",{"v":3203056,"d":"32.03.0.56"}]
[null,"ES","Jerônimo Monteiro","ES - Jerônimo Monteiro",{"v":3203106,"d":"32.03.1.06"}]
[null,"ES","João Neiva","ES - João Neiva",{"v":3203130,"d":"32.03.1.30"}]
[null,"ES","Laranja da Terra","ES - Laranja da Terra",{"v":3203163,"d":"32.03.1.63"}]
[null,"ES","Linhares","ES - Linhares",{"v":3203205,"d":"32.03.2.05"}]
[null,"ES","Mantenópolis","ES - Mantenópolis",{"v":3203304,"d":"32.03.3.04"}]
[null,"ES","Marataízes","ES - Marataízes",{"v":3203320,"d":"32.03.3.20"}]
[null,"ES","Marechal Floriano","ES - Marechal Floriano",{"v":3203346,"d":"32.03.3.46"}]
[null,"ES","Marilândia","ES - Marilândia",{"v":3203353,"d":"32.03.3.53"}]
[null,"ES","Mimoso do Sul","ES - Mimoso do Sul",{"v":3203403,"d":"32.03.4.03"}]
[null,"ES","Montanha","ES - Montanha",{"v":3203502,"d":"32.03.5.02"}]
[null,"ES","Mucurici","ES - Mucurici",{"v":3203601,"d":"32.03.6.01"}]
[null,"ES","Muniz Freire","ES - Muniz Freire",{"v":3203700,"d":"32.03.7.00"}]
[null,"ES","Muqui","ES - Muqui",{"v":3203809,"d":"32.03.8.09"}]
[null,"ES","Nova Venécia","ES - Nova Venécia",{"v":3203908,"d":"32.03.9.08"}]
[null,"ES","Pancas","ES - Pancas",{"v":3204005,"d":"32.04.0.05"}]
[null,"ES","Pedro Canário","ES - Pedro Canário",{"v":3204054,"d":"32.04.0.54"}]
[null,"ES","Pinheiros","ES - Pinheiros",{"v":3204104,"d":"32.04.1.04"}]
[null,"ES","Piúma","ES - Piúma",{"v":3204203,"d":"32.04.2.03"}]
[null,"ES","Ponto Belo","ES - Ponto Belo",{"v":3204252,"d":"32.04.2.52"}]
[null,"ES","Presidente Kennedy","ES - Presidente Kennedy",{"v":3204302,"d":"32.04.3.02"}]
[null,"ES","Rio Bananal","ES - Rio Bananal",{"v":3204351,"d":"32.04.3.51"}]
[null,"ES","Rio Novo do Sul","ES - Rio Novo do Sul",{"v":3204401,"d":"32.04.4.01"}]
[null,"ES","Santa Leopoldina","ES - Santa Leopoldina",{"v":3204500,"d":"32.04.5.00"}]
[null,"ES","Santa Maria de Jetibá","ES - Santa Maria de Jetibá",{"v":3204559,"d":"32.04.5.59"}]
[null,"ES","Santa Teresa","ES - Santa Teresa",{"v":3204609,"d":"32.04.6.09"}]
[null,"ES","São Domingos do Norte","ES - São Domingos do Norte",{"v":3204658,"d":"32.04.6.58"}]
[null,"ES","São Gabriel da Palha","ES - São Gabriel da Palha",{"v":3204708,"d":"32.04.7.08"}]
[null,"ES","São José do Calçado","ES - São José do Calçado",{"v":3204807,"d":"32.04.8.07"}]
[null,"ES","São Mateus","ES - São Mateus",{"v":3204906,"d":"32.04.9.06"}]
[null,"ES","São Roque do Canaã","ES - São Roque do Canaã",{"v":3204955,"d":"32.04.9.55"}]
[null,"ES","Serra","ES - Serra",{"v":3205002,"d":"32.05.0.02"}]
[null,"ES","Sooretama","ES - Sooretama",{"v":3205010,"d":"32.05.0.10"}]
[null,"ES","Vargem Alta","ES - Vargem Alta",{"v":3205036,"d":"32.05.0.36"}]
[null,"ES","Venda Nova do Imigrante","ES - Venda Nova do Imigrante",{"v":3205069,"d":"32.05.0.69"}]
[null,"ES","Viana","ES - Viana",{"v":3205101,"d":"32.05.1.01"}]
[null,"ES","Vila Pavão","ES - Vila Pavão",{"v":3205150,"d":"32.05.1.50"}]
[null,"ES","Vila Valério","ES - Vila Valério",{"v":3205176,"d":"32.05.1.76"}]
[null,"ES","Vila Velha","ES - Vila Velha",{"v":3205200,"d":"32.05.2.00"}]
[null,"ES","Vitória","ES - Vitória",{"v":3205309,"d":"32.05.3.09"}]
[null,"GO","Abadia de Goiás","GO - Abadia de Goiás",{"v":5200050,"d":"52.00.0.50"}]
[null,"GO","Abadiânia","GO - Abadiânia",{"v":5200100,"d":"52.00.1.00"}]
[null,"GO","Acreúna","GO - Acreúna",{"v":5200134,"d":"52.00.1.34"}]
[null,"GO","Adelândia","GO - Adelândia",{"v":5200159,"d":"52.00.1.59"}]
[null,"GO","Água Fria de Goiás","GO - Água Fria de Goiás",{"v":5200175,"d":"52.00.1.75"}]
[null,"GO","Água Limpa","GO - Água Limpa",{"v":5200209,"d":"52.00.2.09"}]
[null,"GO","Águas Lindas de Goiás","GO - Águas Lindas de Goiás",{"v":5200258,"d":"52.00.2.58"}]
[null,"GO","Alexânia","GO - Alexânia",{"v":5200308,"d":"52.00.3.08"}]
[null,"GO","Aloândia","GO - Aloândia",{"v":5200506,"d":"52.00.5.06"}]
[null,"GO","Alto Horizonte","GO - Alto Horizonte",{"v":5200555,"d":"52.00.5.55"}]
[null,"GO","Alto Paraíso de Goiás",{"$f":"CONCATENATE(B927,\" - \",C927)","v":"GO - Alto Paraíso de Goiás"},{"v":5200605,"d":"52.00.6.05"}]
[null,"GO","Alvorada do Norte","GO - Alvorada do Norte",{"v":5200803,"d":"52.00.8.03"}]
[null,"GO","Amaralina","GO - Amaralina",{"v":5200829,"d":"52.00.8.29"}]
[null,"GO","Americano do Brasil","GO - Americano do Brasil",{"v":5200852,"d":"52.00.8.52"}]
[null,"GO","Amorinópolis","GO - Amorinópolis",{"v":5200902,"d":"52.00.9.02"}]
[null,"GO","Anápolis","GO - Anápolis",{"v":5201108,"d":"52.01.1.08"}]
[null,"GO","Anhanguera","GO - Anhanguera",{"v":5201207,"d":"52.01.2.07"}]
[null,"GO","Anicuns","GO - Anicuns",{"v":5201306,"d":"52.01.3.06"}]
[null,"GO","Aparecida de Goiânia","GO - Aparecida de Goiânia",{"v":5201405,"d":"52.01.4.05"}]
[null,"GO","Aparecida do Rio Doce","GO - Aparecida do Rio Doce",{"v":5201454,"d":"52.01.4.54"}]
[null,"GO","Aporé","GO - Aporé",{"v":5201504,"d":"52.01.5.04"}]
[null,"GO","Araçu","GO - Araçu",{"v":5201603,"d":"52.01.6.03"}]
[null,"GO","Aragarças","GO - Aragarças",{"v":5201702,"d":"52.01.7.02"}]
[null,"GO","Aragoiânia","GO - Aragoiânia",{"v":5201801,"d":"52.01.8.01"}]
[null,"GO","Araguapaz","GO - Araguapaz",{"v":5202155,"d":"52.02.1.55"}]
[null,"GO","Arenópolis","GO - Arenópolis",{"v":5202353,"d":"52.02.3.53"}]
[null,"GO","Aruanã","GO - Aruanã",{"v":5202502,"d":"52.02.5.02"}]
[null,"GO","Aurilândia","GO - Aurilândia",{"v":5202601,"d":"52.02.6.01"}]
[null,"GO","Avelinópolis","GO - Avelinópolis",{"v":5202809,"d":"52.02.8.09"}]
[null,"GO","Baliza","GO - Baliza",{"v":5203104,"d":"52.03.1.04"}]
[null,"GO","Barro Alto","GO - Barro Alto",{"v":5203203,"d":"52.03.2.03"}]
[null,"GO","Bela Vista de Goiás","GO - Bela Vista de Goiás",{"v":5203302,"d":"52.03.3.02"}]
[null,"GO","Bom Jardim de Goiás","GO - Bom Jardim de Goiás",{"v":5203401,"d":"52.03.4.01"}]
[null,"GO","Bom Jesus de Goiás","GO - Bom Jesus de Goiás",{"v":5203500,"d":"52.03.5.00"}]
[null,"GO","Bonfinópolis","GO - Bonfinópolis",{"v":5203559,"d":"52.03.5.59"}]
[null,"GO","Bonópolis","GO - Bonópolis",{"v":5203575,"d":"52.03.5.75"}]
[null,"GO","Brazabrantes","GO - Brazabrantes",{"v":5203609,"d":"52.03.6.09"}]
[null,"GO","Britânia","GO - Britânia",{"v":5203807,"d":"52.03.8.07"}]
[null,"GO","Buriti Alegre","GO - Buriti Alegre",{"v":5203906,"d":"52.03.9.06"}]
[null,"GO","Buriti de Goiás","GO - Buriti de Goiás",{"v":5203939,"d":"52.03.9.39"}]
[null,"GO","Buritinópolis","GO - Buritinópolis",{"v":5203962,"d":"52.03.9.62"}]
[null,"GO","Cabeceiras","GO - Cabeceiras",{"v":5204003,"d":"52.04.0.03"}]
[null,"GO","Cachoeira Alta","GO - Cachoeira Alta",{"v":5204102,"d":"52.04.1.02"}]
[null,"GO","Cachoeira de Goiás","GO - Cachoeira de Goiás",{"v":5204201,"d":"52.04.2.01"}]
[null,"GO","Cachoeira Dourada","GO - Cachoeira Dourada",{"v":5204250,"d":"52.04.2.50"}]
[null,"GO","Caçu","GO - Caçu",{"v":5204300,"d":"52.04.3.00"}]
[null,"GO","Caiapônia","GO - Caiapônia",{"v":5204409,"d":"52.04.4.09"}]
[null,"GO","Caldas Novas","GO - Caldas Novas",{"v":5204508,"d":"52.04.5.08"}]
[null,"GO","Caldazinha","GO - Caldazinha",{"v":5204557,"d":"52.04.5.57"}]
[null,"GO","Campestre de Goiás","GO - Campestre de Goiás",{"v":5204607,"d":"52.04.6.07"}]
[null,"GO","Campinaçu","GO - Campinaçu",{"v":5204656,"d":"52.04.6.56"}]
[null,"GO","Campinorte","GO - Campinorte",{"v":5204706,"d":"52.04.7.06"}]
[null,"GO","Campo Alegre de Goiás","GO - Campo Alegre de Goiás",{"v":5204805,"d":"52.04.8.05"}]
[null,"GO","Campo Limpo de Goiás","GO - Campo Limpo de Goiás",{"v":5204854,"d":"52.04.8.54"}]
[null,"GO","Campos Belos","GO - Campos Belos",{"v":5204904,"d":"52.04.9.04"}]
[null,"GO","Campos Verdes","GO - Campos Verdes",{"v":5204953,"d":"52.04.9.53"}]
[null,"GO","Carmo do Rio Verde","GO - Carmo do Rio Verde",{"v":5205000,"d":"52.05.0.00"}]
[null,"GO","Castelândia","GO - Castelândia",{"v":5205059,"d":"52.05.0.59"}]
[null,"GO","Catalão","GO - Catalão",{"v":5205109,"d":"52.05.1.09"}]
[null,"GO","Caturaí","GO - Caturaí",{"v":5205208,"d":"52.05.2.08"}]
[null,"GO","Cavalcante","GO - Cavalcante",{"v":5205307,"d":"52.05.3.07"}]
[null,"GO","Ceres","GO - Ceres",{"v":5205406,"d":"52.05.4.06"}]
[null,"GO","Cezarina","GO - Cezarina",{"v":5205455,"d":"52.05.4.55"}]
[null,"GO","Chapadão do Céu","GO - Chapadão do Céu",{"v":5205471,"d":"52.05.4.71"}]
[null,"GO","Cidade Ocidental","GO - Cidade Ocidental",{"v":5205497,"d":"52.05.4.97"}]
[null,"GO","Cocalzinho de Goiás","GO - Cocalzinho de Goiás",{"v":5205513,"d":"52.05.5.13"}]
[null,"GO","Colinas do Sul","GO - Colinas do Sul",{"v":5205521,"d":"52.05.5.21"}]
[null,"GO","Córrego do Ouro","GO - Córrego do Ouro",{"v":5205703,"d":"52.05.7.03"}]
[null,"GO","Corumbá de Goiás","GO - Corumbá de Goiás",{"v":5205802,"d":"52.05.8.02"}]
[null,"GO","Corumbaíba","GO - Corumbaíba",{"v":5205901,"d":"52.05.9.01"}]
[null,"GO","Cristalina","GO - Cristalina",{"v":5206206,"d":"52.06.2.06"}]
[null,"GO","Cristianópolis","GO - Cristianópolis",{"v":5206305,"d":"52.06.3.05"}]
[null,"GO","Crixás","GO - Crixás",{"v":5206404,"d":"52.06.4.04"}]
[null,"GO","Cromínia","GO - Cromínia",{"v":5206503,"d":"52.06.5.03"}]
[null,"GO","Cumari",{"$f":"CONCATENATE(B991,\" - \",C991)","v":"GO - Cumari"},{"v":5206602,"d":"52.06.6.02"}]
[null,"GO","Damianópolis","GO - Damianópolis",{"v":5206701,"d":"52.06.7.01"}]
[null,"GO","Damolândia","GO - Damolândia",{"v":5206800,"d":"52.06.8.00"}]
[null,"GO","Davinópolis","GO - Davinópolis",{"v":5206909,"d":"52.06.9.09"}]
[null,"GO","Diorama","GO - Diorama",{"v":5207105,"d":"52.07.1.05"}]
[null,"GO","Divinópolis de Goiás","GO - Divinópolis de Goiás",{"v":5208301,"d":"52.08.3.01"}]
[null,"GO","Doverlândia","GO - Doverlândia",{"v":5207253,"d":"52.07.2.53"}]
[null,"GO","Edealina","GO - Edealina",{"v":5207352,"d":"52.07.3.52"}]
[null,"GO","Edéia","GO - Edéia",{"v":5207402,"d":"52.07.4.02"}]
[null,"GO","Estrela do Norte","GO - Estrela do Norte",{"v":5207501,"d":"52.07.5.01"}]
[null,"GO","Faina","GO - Faina",{"v":5207535,"d":"52.07.5.35"}]
[null,"GO","Fazenda Nova","GO - Fazenda Nova",{"v":5207600,"d":"52.07.6.00"}]
[null,"GO","Firminópolis","GO - Firminópolis",{"v":5207808,"d":"52.07.8.08"}]
[null,"GO","Flores de Goiás","GO - Flores de Goiás",{"v":5207907,"d":"52.07.9.07"}]
[null,"GO","Formosa","GO - Formosa",{"v":5208004,"d":"52.08.0.04"}]
[null,"GO","Formoso","GO - Formoso",{"v":5208103,"d":"52.08.1.03"}]
[null,"GO","Gameleira de Goiás","GO - Gameleira de Goiás",{"v":5208152,"d":"52.08.1.52"}]
[null,"GO","Goianápolis","GO - Goianápolis",{"v":5208400,"d":"52.08.4.00"}]
[null,"GO","Goiandira","GO - Goiandira",{"v":5208509,"d":"52.08.5.09"}]
[null,"GO","Goianésia","GO - Goianésia",{"v":5208608,"d":"52.08.6.08"}]
[null,"GO","Goiânia","GO - Goiânia",{"v":5208707,"d":"52.08.7.07"}]
[null,"GO","Goianira","GO - Goianira",{"v":5208806,"d":"52.08.8.06"}]
[null,"GO","Goiás","GO - Goiás",{"v":5208905,"d":"52.08.9.05"}]
[null,"GO","Goiatuba","GO - Goiatuba",{"v":5209101,"d":"52.09.1.01"}]
[null,"GO","Gouvelândia","GO - Gouvelândia",{"v":5209150,"d":"52.09.1.50"}]
[null,"GO","Guapó","GO - Guapó",{"v":5209200,"d":"52.09.2.00"}]
[null,"GO","Guaraíta","GO - Guaraíta",{"v":5209291,"d":"52.09.2.91"}]
[null,"GO","Guarani de Goiás","GO - Guarani de Goiás",{"v":5209408,"d":"52.09.4.08"}]
[null,"GO","Guarinos","GO - Guarinos",{"v":5209457,"d":"52.09.4.57"}]
[null,"GO","Heitoraí","GO - Heitoraí",{"v":5209606,"d":"52.09.6.06"}]
[null,"GO","Hidrolândia","GO - Hidrolândia",{"v":5209705,"d":"52.09.7.05"}]
[null,"GO","Hidrolina","GO - Hidrolina",{"v":5209804,"d":"52.09.8.04"}]
[null,"GO","Iaciara","GO - Iaciara",{"v":5209903,"d":"52.09.9.03"}]
[null,"GO","Inaciolândia","GO - Inaciolândia",{"v":5209937,"d":"52.09.9.37"}]
[null,"GO","Indiara","GO - Indiara",{"v":5209952,"d":"52.09.9.52"}]
[null,"GO","Inhumas","GO - Inhumas",{"v":5210000,"d":"52.10.0.00"}]
[null,"GO","Ipameri","GO - Ipameri",{"v":5210109,"d":"52.10.1.09"}]
[null,"GO","Ipiranga de Goiás","GO - Ipiranga de Goiás",{"v":5210158,"d":"52.10.1.58"}]
[null,"GO","Iporá","GO - Iporá",{"v":5210208,"d":"52.10.2.08"}]
[null,"GO","Israelândia","GO - Israelândia",{"v":5210307,"d":"52.10.3.07"}]
[null,"GO","Itaberaí","GO - Itaberaí",{"v":5210406,"d":"52.10.4.06"}]
[null,"GO","Itaguari","GO - Itaguari",{"v":5210562,"d":"52.10.5.62"}]
[null,"GO","Itaguaru","GO - Itaguaru",{"v":5210604,"d":"52.10.6.04"}]
[null,"GO","Itajá","GO - Itajá",{"v":5210802,"d":"52.10.8.02"}]
[null,"GO","Itapaci","GO - Itapaci",{"v":5210901,"d":"52.10.9.01"}]
[null,"GO","Itapirapuã","GO - Itapirapuã",{"v":5211008,"d":"52.11.0.08"}]
[null,"GO","Itapuranga","GO - Itapuranga",{"v":5211206,"d":"52.11.2.06"}]
[null,"GO","Itarumã","GO - Itarumã",{"v":5211305,"d":"52.11.3.05"}]
[null,"GO","Itauçu","GO - Itauçu",{"v":5211404,"d":"52.11.4.04"}]
[null,"GO","Itumbiara","GO - Itumbiara",{"v":5211503,"d":"52.11.5.03"}]
[null,"GO","Ivolândia","GO - Ivolândia",{"v":5211602,"d":"52.11.6.02"}]
[null,"GO","Jandaia","GO - Jandaia",{"v":5211701,"d":"52.11.7.01"}]
[null,"GO","Jaraguá","GO - Jaraguá",{"v":5211800,"d":"52.11.8.00"}]
[null,"GO","Jataí","GO - Jataí",{"v":5211909,"d":"52.11.9.09"}]
[null,"GO","Jaupaci","GO - Jaupaci",{"v":5212006,"d":"52.12.0.06"}]
[null,"GO","Jesúpolis","GO - Jesúpolis",{"v":5212055,"d":"52.12.0.55"}]
[null,"GO","Joviânia","GO - Joviânia",{"v":5212105,"d":"52.12.1.05"}]
[null,"GO","Jussara","GO - Jussara",{"v":5212204,"d":"52.12.2.04"}]
[null,"GO","Lagoa Santa","GO - Lagoa Santa",{"v":5212253,"d":"52.12.2.53"}]
[null,"GO","Leopoldo de Bulhões","GO - Leopoldo de Bulhões",{"v":5212303,"d":"52.12.3.03"}]
[null,"GO","Luziânia","GO - Luziânia",{"v":5212501,"d":"52.12.5.01"}]
[null,"GO","Mairipotaba","GO - Mairipotaba",{"v":5212600,"d":"52.12.6.00"}]
[null,"GO","Mambaí","GO - Mambaí",{"v":5212709,"d":"52.12.7.09"}]
[null,"GO","Mara Rosa","GO - Mara Rosa",{"v":5212808,"d":"52.12.8.08"}]
[null,"GO","Marzagão",{"$f":"CONCATENATE(B1055,\" - \",C1055)","v":"GO - Marzagão"},{"v":5212907,"d":"52.12.9.07"}]
[null,"GO","Matrinchã","GO - Matrinchã",{"v":5212956,"d":"52.12.9.56"}]
[null,"GO","Maurilândia","GO - Maurilândia",{"v":5213004,"d":"52.13.0.04"}]
[null,"GO","Mimoso de Goiás","GO - Mimoso de Goiás",{"v":5213053,"d":"52.13.0.53"}]
[null,"GO","Minaçu","GO - Minaçu",{"v":5213087,"d":"52.13.0.87"}]
[null,"GO","Mineiros","GO - Mineiros",{"v":5213103,"d":"52.13.1.03"}]
[null,"GO","Moiporá","GO - Moiporá",{"v":5213400,"d":"52.13.4.00"}]
[null,"GO","Monte Alegre de Goiás","GO - Monte Alegre de Goiás",{"v":5213509,"d":"52.13.5.09"}]
[null,"GO","Montes Claros de Goiás","GO - Montes Claros de Goiás",{"v":5213707,"d":"52.13.7.07"}]
[null,"GO","Montividiu","GO - Montividiu",{"v":5213756,"d":"52.13.7.56"}]
[null,"GO","Montividiu do Norte","GO - Montividiu do Norte",{"v":5213772,"d":"52.13.7.72"}]
[null,"GO","Morrinhos","GO - Morrinhos",{"v":5213806,"d":"52.13.8.06"}]
[null,"GO","Morro Agudo de Goiás","GO - Morro Agudo de Goiás",{"v":5213855,"d":"52.13.8.55"}]
[null,"GO","Mossâmedes","GO - Mossâmedes",{"v":5213905,"d":"52.13.9.05"}]
[null,"GO","Mozarlândia","GO - Mozarlândia",{"v":5214002,"d":"52.14.0.02"}]
[null,"GO","Mundo Novo","GO - Mundo Novo",{"v":5214051,"d":"52.14.0.51"}]
[null,"GO","Mutunópolis","GO - Mutunópolis",{"v":5214101,"d":"52.14.1.01"}]
[null,"GO","Nazário","GO - Nazário",{"v":5214408,"d":"52.14.4.08"}]
[null,"GO","Nerópolis","GO - Nerópolis",{"v":5214507,"d":"52.14.5.07"}]
[null,"GO","Niquelândia","GO - Niquelândia",{"v":5214606,"d":"52.14.6.06"}]
[null,"GO","Nova América","GO - Nova América",{"v":5214705,"d":"52.14.7.05"}]
[null,"GO","Nova Aurora","GO - Nova Aurora",{"v":5214804,"d":"52.14.8.04"}]
[null,"GO","Nova Crixás","GO - Nova Crixás",{"v":5214838,"d":"52.14.8.38"}]
[null,"GO","Nova Glória","GO - Nova Glória",{"v":5214861,"d":"52.14.8.61"}]
[null,"GO","Nova Iguaçu de Goiás","GO - Nova Iguaçu de Goiás",{"v":5214879,"d":"52.14.8.79"}]
[null,"GO","Nova Roma","GO - Nova Roma",{"v":5214903,"d":"52.14.9.03"}]
[null,"GO","Nova Veneza","GO - Nova Veneza",{"v":5215009,"d":"52.15.0.09"}]
[null,"GO","Novo Brasil","GO - Novo Brasil",{"v":5215207,"d":"52.15.2.07"}]
[null,"GO","Novo Gama","GO - Novo Gama",{"v":5215231,"d":"52.15.2.31"}]
[null,"GO","Novo Planalto","GO - Novo Planalto",{"v":5215256,"d":"52.15.2.56"}]
[null,"GO","Orizona","GO - Orizona",{"v":5215306,"d":"52.15.3.06"}]
[null,"GO","Ouro Verde de Goiás","GO - Ouro Verde de Goiás",{"v":5215405,"d":"52.15.4.05"}]
[null,"GO","Ouvidor","GO - Ouvidor",{"v":5215504,"d":"52.15.5.04"}]
[null,"GO","Padre Bernardo","GO - Padre Bernardo",{"v":5215603,"d":"52.15.6.03"}]
[null,"GO","Palestina de Goiás","GO - Palestina de Goiás",{"v":5215652,"d":"52.15.6.52"}]
[null,"GO","Palmeiras de Goiás","GO - Palmeiras de Goiás",{"v":5215702,"d":"52.15.7.02"}]
[null,"GO","Palmelo","GO - Palmelo",{"v":5215801,"d":"52.15.8.01"}]
[null,"GO","Palminópolis","GO - Palminópolis",{"v":5215900,"d":"52.15.9.00"}]
[null,"GO","Panamá","GO - Panamá",{"v":5216007,"d":"52.16.0.07"}]
[null,"GO","Paranaiguara","GO - Paranaiguara",{"v":5216304,"d":"52.16.3.04"}]
[null,"GO","Paraúna","GO - Paraúna",{"v":5216403,"d":"52.16.4.03"}]
[null,"GO","Perolândia","GO - Perolândia",{"v":5216452,"d":"52.16.4.52"}]
[null,"GO","Petrolina de Goiás","GO - Petrolina de Goiás",{"v":5216809,"d":"52.16.8.09"}]
[null,"GO","Pilar de Goiás","GO - Pilar de Goiás",{"v":5216908,"d":"52.16.9.08"}]
[null,"GO","Piracanjuba","GO - Piracanjuba",{"v":5217104,"d":"52.17.1.04"}]
[null,"GO","Piranhas","GO - Piranhas",{"v":5217203,"d":"52.17.2.03"}]
[null,"GO","Pirenópolis","GO - Pirenópolis",{"v":5217302,"d":"52.17.3.02"}]
[null,"GO","Pires do Rio","GO - Pires do Rio",{"v":5217401,"d":"52.17.4.01"}]
[null,"GO","Planaltina","GO - Planaltina",{"v":5217609,"d":"52.17.6.09"}]
[null,"GO","Pontalina","GO - Pontalina",{"v":5217708,"d":"52.17.7.08"}]
[null,"GO","Porangatu","GO - Porangatu",{"v":5218003,"d":"52.18.0.03"}]
[null,"GO","Porteirão","GO - Porteirão",{"v":5218052,"d":"52.18.0.52"}]
[null,"GO","Portelândia","GO - Portelândia",{"v":5218102,"d":"52.18.1.02"}]
[null,"GO","Posse","GO - Posse",{"v":5218300,"d":"52.18.3.00"}]
[null,"GO","Professor Jamil","GO - Professor Jamil",{"v":5218391,"d":"52.18.3.91"}]
[null,"GO","Quirinópolis","GO - Quirinópolis",{"v":5218508,"d":"52.18.5.08"}]
[null,"GO","Rialma","GO - Rialma",{"v":5218607,"d":"52.18.6.07"}]
[null,"GO","Rianápolis","GO - Rianápolis",{"v":5218706,"d":"52.18.7.06"}]
[null,"GO","Rio Quente","GO - Rio Quente",{"v":5218789,"d":"52.18.7.89"}]
[null,"GO","Rio Verde","GO - Rio Verde",{"v":5218805,"d":"52.18.8.05"}]
[null,"GO","Rubiataba","GO - Rubiataba",{"v":5218904,"d":"52.18.9.04"}]
[null,"GO","Sanclerlândia","GO - Sanclerlândia",{"v":5219001,"d":"52.19.0.01"}]
[null,"GO","Santa Bárbara de Goiás","GO - Santa Bárbara de Goiás",{"v":5219100,"d":"52.19.1.00"}]
[null,"GO","Santa Cruz de Goiás","GO - Santa Cruz de Goiás",{"v":5219209,"d":"52.19.2.09"}]
[null,"GO","Santa Fé de Goiás",{"$f":"CONCATENATE(B1119,\" - \",C1119)","v":"GO - Santa Fé de Goiás"},{"v":5219258,"d":"52.19.2.58"}]
[null,"GO","Santa Helena de Goiás","GO - Santa Helena de Goiás",{"v":5219308,"d":"52.19.3.08"}]
[null,"GO","Santa Isabel","GO - Santa Isabel",{"v":5219357,"d":"52.19.3.57"}]
[null,"GO","Santa Rita do Araguaia","GO - Santa Rita do Araguaia",{"v":5219407,"d":"52.19.4.07"}]
[null,"GO","Santa Rita do Novo Destino","GO - Santa Rita do Novo Destino",{"v":5219456,"d":"52.19.4.56"}]
[null,"GO","Santa Rosa de Goiás","GO - Santa Rosa de Goiás",{"v":5219506,"d":"52.19.5.06"}]
[null,"GO","Santa Tereza de Goiás","GO - Santa Tereza de Goiás",{"v":5219605,"d":"52.19.6.05"}]
[null,"GO","Santa Terezinha de Goiás","GO - Santa Terezinha de Goiás",{"v":5219704,"d":"52.19.7.04"}]
[null,"GO","Santo Antônio da Barra","GO - Santo Antônio da Barra",{"v":5219712,"d":"52.19.7.12"}]
[null,"GO","Santo Antônio de Goiás","GO - Santo Antônio de Goiás",{"v":5219738,"d":"52.19.7.38"}]
[null,"GO","Santo Antônio do Descoberto","GO - Santo Antônio do Descoberto",{"v":5219753,"d":"52.19.7.53"}]
[null,"GO","São Domingos","GO - São Domingos",{"v":5219803,"d":"52.19.8.03"}]
[null,"GO","São Francisco de Goiás","GO - São Francisco de Goiás",{"v":5219902,"d":"52.19.9.02"}]
[null,"GO","São João da Paraúna","GO - São João da Paraúna",{"v":5220058,"d":"52.20.0.58"}]
[null,"GO","São João d'Aliança","GO - São João d'Aliança",{"v":5220009,"d":"52.20.0.09"}]
[null,"GO","São Luís de Montes Belos","GO - São Luís de Montes Belos",{"v":5220108,"d":"52.20.1.08"}]
[null,"GO","São Luíz do Norte","GO - São Luíz do Norte",{"v":5220157,"d":"52.20.1.57"}]
[null,"GO","São Miguel do Araguaia","GO - São Miguel do Araguaia",{"v":5220207,"d":"52.20.2.07"}]
[null,"GO","São Miguel do Passa Quatro","GO - São Miguel do Passa Quatro",{"v":5220264,"d":"52.20.2.64"}]
[null,"GO","São Patrício","GO - São Patrício",{"v":5220280,"d":"52.20.2.80"}]
[null,"GO","São Simão","GO - São Simão",{"v":5220405,"d":"52.20.4.05"}]
[null,"GO","Senador Canedo","GO - Senador Canedo",{"v":5220454,"d":"52.20.4.54"}]
[null,"GO","Serranópolis","GO - Serranópolis",{"v":5220504,"d":"52.20.5.04"}]
[null,"GO","Silvânia","GO - Silvânia",{"v":5220603,"d":"52.20.6.03"}]
[null,"GO","Simolândia","GO - Simolândia",{"v":5220686,"d":"52.20.6.86"}]
[null,"GO","Sítio d'Abadia","GO - Sítio d'Abadia",{"v":5220702,"d":"52.20.7.02"}]
[null,"GO","Taquaral de Goiás","GO - Taquaral de Goiás",{"v":5221007,"d":"52.21.0.07"}]
[null,"GO","Teresina de Goiás","GO - Teresina de Goiás",{"v":5221080,"d":"52.21.0.80"}]
[null,"GO","Terezópolis de Goiás","GO - Terezópolis de Goiás",{"v":5221197,"d":"52.21.1.97"}]
[null,"GO","Três Ranchos","GO - Três Ranchos",{"v":5221304,"d":"52.21.3.04"}]
[null,"GO","Trindade","GO - Trindade",{"v":5221403,"d":"52.21.4.03"}]
[null,"GO","Trombas","GO - Trombas",{"v":5221452,"d":"52.21.4.52"}]
[null,"GO","Turvânia","GO - Turvânia",{"v":5221502,"d":"52.21.5.02"}]
[null,"GO","Turvelândia","GO - Turvelândia",{"v":5221551,"d":"52.21.5.51"}]
[null,"GO","Uirapuru","GO - Uirapuru",{"v":5221577,"d":"52.21.5.77"}]
[null,"GO","Uruaçu","GO - Uruaçu",{"v":5221601,"d":"52.21.6.01"}]
[null,"GO","Uruana","GO - Uruana",{"v":5221700,"d":"52.21.7.00"}]
[null,"GO","Urutaí","GO - Urutaí",{"v":5221809,"d":"52.21.8.09"}]
[null,"GO","Valparaíso de Goiás","GO - Valparaíso de Goiás",{"v":5221858,"d":"52.21.8.58"}]
[null,"GO","Varjão","GO - Varjão",{"v":5221908,"d":"52.21.9.08"}]
[null,"GO","Vianópolis","GO - Vianópolis",{"v":5222005,"d":"52.22.0.05"}]
[null,"GO","Vicentinópolis","GO - Vicentinópolis",{"v":5222054,"d":"52.22.0.54"}]
[null,"GO","Vila Boa","GO - Vila Boa",{"v":5222203,"d":"52.22.2.03"}]
[null,"GO","Vila Propício","GO - Vila Propício",{"v":5222302,"d":"52.22.3.02"}]
[null,"MA","Açailândia","MA - Açailândia",{"v":2100055,"d":"21.00.0.55"}]
[null,"MA","Afonso Cunha","MA - Afonso Cunha",{"v":2100105,"d":"21.00.1.05"}]
[null,"MA","Água Doce do Maranhão","MA - Água Doce do Maranhão",{"v":2100154,"d":"21.00.1.54"}]
[null,"MA","Alcântara","MA - Alcântara",{"v":2100204,"d":"21.00.2.04"}]
[null,"MA","Aldeias Altas","MA - Aldeias Altas",{"v":2100303,"d":"21.00.3.03"}]
[null,"MA","Altamira do Maranhão","MA - Altamira do Maranhão",{"v":2100402,"d":"21.00.4.02"}]
[null,"MA","Alto Alegre do Maranhão","MA - Alto Alegre do Maranhão",{"v":2100436,"d":"21.00.4.36"}]
[null,"MA","Alto Alegre do Pindaré","MA - Alto Alegre do Pindaré",{"v":2100477,"d":"21.00.4.77"}]
[null,"MA","Alto Parnaíba","MA - Alto Parnaíba",{"v":2100501,"d":"21.00.5.01"}]
[null,"MA","Amapá do Maranhão","MA - Amapá do Maranhão",{"v":2100550,"d":"21.00.5.50"}]
[null,"MA","Amarante do Maranhão","MA - Amarante do Maranhão",{"v":2100600,"d":"21.00.6.00"}]
[null,"MA","Anajatuba","MA - Anajatuba",{"v":2100709,"d":"21.00.7.09"}]
[null,"MA","Anapurus","MA - Anapurus",{"v":2100808,"d":"21.00.8.08"}]
[null,"MA","Apicum-Açu","MA - Apicum-Açu",{"v":2100832,"d":"21.00.8.32"}]
[null,"MA","Araguanã","MA - Araguanã",{"v":2100873,"d":"21.00.8.73"}]
[null,"MA","Araioses","MA - Araioses",{"v":2100907,"d":"21.00.9.07"}]
[null,"MA","Arame","MA - Arame",{"v":2100956,"d":"21.00.9.56"}]
[null,"MA","Arari","MA - Arari",{"v":2101004,"d":"21.01.0.04"}]
[null,"MA","Axixá","MA - Axixá",{"v":2101103,"d":"21.01.1.03"}]
[null,"MA","Bacabal","MA - Bacabal",{"v":2101202,"d":"21.01.2.02"}]
[null,"MA","Bacabeira",{"$f":"CONCATENATE(B1183,\" - \",C1183)","v":"MA - Bacabeira"},{"v":2101251,"d":"21.01.2.51"}]
[null,"MA","Bacuri","MA - Bacuri",{"v":2101301,"d":"21.01.3.01"}]
[null,"MA","Bacurituba","MA - Bacurituba",{"v":2101350,"d":"21.01.3.50"}]
[null,"MA","Balsas","MA - Balsas",{"v":2101400,"d":"21.01.4.00"}]
[null,"MA","Barão de Grajaú","MA - Barão de Grajaú",{"v":2101509,"d":"21.01.5.09"}]
[null,"MA","Barra do Corda","MA - Barra do Corda",{"v":2101608,"d":"21.01.6.08"}]
[null,"MA","Barreirinhas","MA - Barreirinhas",{"v":2101707,"d":"21.01.7.07"}]
[null,"MA","Bela Vista do Maranhão","MA - Bela Vista do Maranhão",{"v":2101772,"d":"21.01.7.72"}]
[null,"MA","Belágua","MA - Belágua",{"v":2101731,"d":"21.01.7.31"}]
[null,"MA","Benedito Leite","MA - Benedito Leite",{"v":2101806,"d":"21.01.8.06"}]
[null,"MA","Bequimão","MA - Bequimão",{"v":2101905,"d":"21.01.9.05"}]
[null,"MA","Bernardo do Mearim","MA - Bernardo do Mearim",{"v":2101939,"d":"21.01.9.39"}]
[null,"MA","Boa Vista do Gurupi","MA - Boa Vista do Gurupi",{"v":2101970,"d":"21.01.9.70"}]
[null,"MA","Bom Jardim","MA - Bom Jardim",{"v":2102002,"d":"21.02.0.02"}]
[null,"MA","Bom Jesus das Selvas","MA - Bom Jesus das Selvas",{"v":2102036,"d":"21.02.0.36"}]
[null,"MA","Bom Lugar","MA - Bom Lugar",{"v":2102077,"d":"21.02.0.77"}]
[null,"MA","Brejo","MA - Brejo",{"v":2102101,"d":"21.02.1.01"}]
[null,"MA","Brejo de Areia","MA - Brejo de Areia",{"v":2102150,"d":"21.02.1.50"}]
[null,"MA","Buriti","MA - Buriti",{"v":2102200,"d":"21.02.2.00"}]
[null,"MA","Buriti Bravo","MA - Buriti Bravo",{"v":2102309,"d":"21.02.3.09"}]
[null,"MA","Buriticupu","MA - Buriticupu",{"v":2102325,"d":"21.02.3.25"}]
[null,"MA","Buritirana","MA - Buritirana",{"v":2102358,"d":"21.02.3.58"}]
[null,"MA","Cachoeira Grande","MA - Cachoeira Grande",{"v":2102374,"d":"21.02.3.74"}]
[null,"MA","Cajapió","MA - Cajapió",{"v":2102408,"d":"21.02.4.08"}]
[null,"MA","Cajari","MA - Cajari",{"v":2102507,"d":"21.02.5.07"}]
[null,"MA","Campestre do Maranhão","MA - Campestre do Maranhão",{"v":2102556,"d":"21.02.5.56"}]
[null,"MA","Cândido Mendes","MA - Cândido Mendes",{"v":2102606,"d":"21.02.6.06"}]
[null,"MA","Cantanhede","MA - Cantanhede",{"v":2102705,"d":"21.02.7.05"}]
[null,"MA","Capinzal do Norte","MA - Capinzal do Norte",{"v":2102754,"d":"21.02.7.54"}]
[null,"MA","Carolina","MA - Carolina",{"v":2102804,"d":"21.02.8.04"}]
[null,"MA","Carutapera","MA - Carutapera",{"v":2102903,"d":"21.02.9.03"}]
[null,"MA","Caxias","MA - Caxias",{"v":2103000,"d":"21.03.0.00"}]
[null,"MA","Cedral","MA - Cedral",{"v":2103109,"d":"21.03.1.09"}]
[null,"MA","Central do Maranhão","MA - Central do Maranhão",{"v":2103125,"d":"21.03.1.25"}]
[null,"MA","Centro do Guilherme","MA - Centro do Guilherme",{"v":2103158,"d":"21.03.1.58"}]
[null,"MA","Centro Novo do Maranhão","MA - Centro Novo do Maranhão",{"v":2103174,"d":"21.03.1.74"}]
[null,"MA","Chapadinha","MA - Chapadinha",{"v":2103208,"d":"21.03.2.08"}]
[null,"MA","Cidelândia","MA - Cidelândia",{"v":2103257,"d":"21.03.2.57"}]
[null,"MA","Codó","MA - Codó",{"v":2103307,"d":"21.03.3.07"}]
[null,"MA","Coelho Neto","MA - Coelho Neto",{"v":2103406,"d":"21.03.4.06"}]
[null,"MA","Colinas","MA - Colinas",{"v":2103505,"d":"21.03.5.05"}]
[null,"MA","Conceição do Lago-Açu","MA - Conceição do Lago-Açu",{"v":2103554,"d":"21.03.5.54"}]
[null,"MA","Coroatá","MA - Coroatá",{"v":2103604,"d":"21.03.6.04"}]
[null,"MA","Cururupu","MA - Cururupu",{"v":2103703,"d":"21.03.7.03"}]
[null,"MA","Davinópolis","MA - Davinópolis",{"v":2103752,"d":"21.03.7.52"}]
[null,"MA","Dom Pedro","MA - Dom Pedro",{"v":2103802,"d":"21.03.8.02"}]
[null,"MA","Duque Bacelar","MA - Duque Bacelar",{"v":2103901,"d":"21.03.9.01"}]
[null,"MA","Esperantinópolis","MA - Esperantinópolis",{"v":2104008,"d":"21.04.0.08"}]
[null,"MA","Estreito","MA - Estreito",{"v":2104057,"d":"21.04.0.57"}]
[null,"MA","Feira Nova do Maranhão","MA - Feira Nova do Maranhão",{"v":2104073,"d":"21.04.0.73"}]
[null,"MA","Fernando Falcão","MA - Fernando Falcão",{"v":2104081,"d":"21.04.0.81"}]
[null,"MA","Formosa da Serra Negra","MA - Formosa da Serra Negra",{"v":2104099,"d":"21.04.0.99"}]
[null,"MA","Fortaleza dos Nogueiras","MA - Fortaleza dos Nogueiras",{"v":2104107,"d":"21.04.1.07"}]
[null,"MA","Fortuna","MA - Fortuna",{"v":2104206,"d":"21.04.2.06"}]
[null,"MA","Godofredo Viana","MA - Godofredo Viana",{"v":2104305,"d":"21.04.3.05"}]
[null,"MA","Gonçalves Dias","MA - Gonçalves Dias",{"v":2104404,"d":"21.04.4.04"}]
[null,"MA","Governador Archer","MA - Governador Archer",{"v":2104503,"d":"21.04.5.03"}]
[null,"MA","Governador Edison Lobão","MA - Governador Edison Lobão",{"v":2104552,"d":"21.04.5.52"}]
[null,"MA","Governador Eugênio Barros","MA - Governador Eugênio Barros",{"v":2104602,"d":"21.04.6.02"}]
[null,"MA","Governador Luiz Rocha","MA - Governador Luiz Rocha",{"v":2104628,"d":"21.04.6.28"}]
[null,"MA","Governador Newton Bello","MA - Governador Newton Bello",{"v":2104651,"d":"21.04.6.51"}]
[null,"MA","Governador Nunes Freire","MA - Governador Nunes Freire",{"v":2104677,"d":"21.04.6.77"}]
[null,"MA","Graça Aranha","MA - Graça Aranha",{"v":2104701,"d":"21.04.7.01"}]
[null,"MA","Grajaú","MA - Grajaú",{"v":2104800,"d":"21.04.8.00"}]
[null,"MA","Guimarães",{"$f":"CONCATENATE(B1247,\" - \",C1247)","v":"MA - Guimarães"},{"v":2104909,"d":"21.04.9.09"}]
[null,"MA","Humberto de Campos","MA - Humberto de Campos",{"v":2105005,"d":"21.05.0.05"}]
[null,"MA","Icatu","MA - Icatu",{"v":2105104,"d":"21.05.1.04"}]
[null,"MA","Igarapé do Meio","MA - Igarapé do Meio",{"v":2105153,"d":"21.05.1.53"}]
[null,"MA","Igarapé Grande","MA - Igarapé Grande",{"v":2105203,"d":"21.05.2.03"}]
[null,"MA","Imperatriz","MA - Imperatriz",{"v":2105302,"d":"21.05.3.02"}]
[null,"MA","Itaipava do Grajaú","MA - Itaipava do Grajaú",{"v":2105351,"d":"21.05.3.51"}]
[null,"MA","Itapecuru Mirim","MA - Itapecuru Mirim",{"v":2105401,"d":"21.05.4.01"}]
[null,"MA","Itinga do Maranhão","MA - Itinga do Maranhão",{"v":2105427,"d":"21.05.4.27"}]
[null,"MA","Jatobá","MA - Jatobá",{"v":2105450,"d":"21.05.4.50"}]
[null,"MA","Jenipapo dos Vieiras","MA - Jenipapo dos Vieiras",{"v":2105476,"d":"21.05.4.76"}]
[null,"MA","João Lisboa","MA - João Lisboa",{"v":2105500,"d":"21.05.5.00"}]
[null,"MA","Joselândia","MA - Joselândia",{"v":2105609,"d":"21.05.6.09"}]
[null,"MA","Junco do Maranhão","MA - Junco do Maranhão",{"v":2105658,"d":"21.05.6.58"}]
[null,"MA","Lago da Pedra","MA - Lago da Pedra",{"v":2105708,"d":"21.05.7.08"}]
[null,"MA","Lago do Junco","MA - Lago do Junco",{"v":2105807,"d":"21.05.8.07"}]
[null,"MA","Lago dos Rodrigues","MA - Lago dos Rodrigues",{"v":2105948,"d":"21.05.9.48"}]
[null,"MA","Lago Verde","MA - Lago Verde",{"v":2105906,"d":"21.05.9.06"}]
[null,"MA","Lagoa do Mato","MA - Lagoa do Mato",{"v":2105922,"d":"21.05.9.22"}]
[null,"MA","Lagoa Grande do Maranhão","MA - Lagoa Grande do Maranhão",{"v":2105963,"d":"21.05.9.63"}]
[null,"MA","Lajeado Novo","MA - Lajeado Novo",{"v":2105989,"d":"21.05.9.89"}]
[null,"MA","Lima Campos","MA - Lima Campos",{"v":2106003,"d":"21.06.0.03"}]
[null,"MA","Loreto","MA - Loreto",{"v":2106102,"d":"21.06.1.02"}]
[null,"MA","Luís Domingues","MA - Luís Domingues",{"v":2106201,"d":"21.06.2.01"}]
[null,"MA","Magalhães de Almeida","MA - Magalhães de Almeida",{"v":2106300,"d":"21.06.3.00"}]
[null,"MA","Maracaçumé","MA - Maracaçumé",{"v":2106326,"d":"21.06.3.26"}]
[null,"MA","Marajá do Sena","MA - Marajá do Sena",{"v":2106359,"d":"21.06.3.59"}]
[null,"MA","Maranhãozinho","MA - Maranhãozinho",{"v":2106375,"d":"21.06.3.75"}]
[null,"MA","Mata Roma","MA - Mata Roma",{"v":2106409,"d":"21.06.4.09"}]
[null,"MA","Matinha","MA - Matinha",{"v":2106508,"d":"21.06.5.08"}]
[null,"MA","Matões","MA - Matões",{"v":2106607,"d":"21.06.6.07"}]
[null,"MA","Matões do Norte","MA - Matões do Norte",{"v":2106631,"d":"21.06.6.31"}]
[null,"MA","Milagres do Maranhão","MA - Milagres do Maranhão",{"v":2106672,"d":"21.06.6.72"}]
[null,"MA","Mirador","MA - Mirador",{"v":2106706,"d":"21.06.7.06"}]
[null,"MA","Miranda do Norte","MA - Miranda do Norte",{"v":2106755,"d":"21.06.7.55"}]
[null,"MA","Mirinzal","MA - Mirinzal",{"v":2106805,"d":"21.06.8.05"}]
[null,"MA","Monção","MA - Monção",{"v":2106904,"d":"21.06.9.04"}]
[null,"MA","Montes Altos","MA - Montes Altos",{"v":2107001,"d":"21.07.0.01"}]
[null,"MA","Morros","MA - Morros",{"v":2107100,"d":"21.07.1.00"}]
[null,"MA","Nina Rodrigues","MA - Nina Rodrigues",{"v":2107209,"d":"21.07.2.09"}]
[null,"MA","Nova Colinas","MA - Nova Colinas",{"v":2107258,"d":"21.07.2.58"}]
[null,"MA","Nova Iorque","MA - Nova Iorque",{"v":2107308,"d":"21.07.3.08"}]
[null,"MA","Nova Olinda do Maranhão","MA - Nova Olinda do Maranhão",{"v":2107357,"d":"21.07.3.57"}]
[null,"MA","Olho d'Água das Cunhãs","MA - Olho d'Água das Cunhãs",{"v":2107407,"d":"21.07.4.07"}]
[null,"MA","Olinda Nova do Maranhão","MA - Olinda Nova do Maranhão",{"v":2107456,"d":"21.07.4.56"}]
[null,"MA","Paço do Lumiar","MA - Paço do Lumiar",{"v":2107506,"d":"21.07.5.06"}]
[null,"MA","Palmeirândia","MA - Palmeirândia",{"v":2107605,"d":"21.07.6.05"}]
[null,"MA","Paraibano","MA - Paraibano",{"v":2107704,"d":"21.07.7.04"}]
[null,"MA","Parnarama","MA - Parnarama",{"v":2107803,"d":"21.07.8.03"}]
[null,"MA","Passagem Franca","MA - Passagem Franca",{"v":2107902,"d":"21.07.9.02"}]
[null,"MA","Pastos Bons","MA - Pastos Bons",{"v":2108009,"d":"21.08.0.09"}]
[null,"MA","Paulino Neves","MA - Paulino Neves",{"v":2108058,"d":"21.08.0.58"}]
[null,"MA","Paulo Ramos","MA - Paulo Ramos",{"v":2108108,"d":"21.08.1.08"}]
[null,"MA","Pedreiras","MA - Pedreiras",{"v":2108207,"d":"21.08.2.07"}]
[null,"MA","Pedro do Rosário","MA - Pedro do Rosário",{"v":2108256,"d":"21.08.2.56"}]
[null,"MA","Penalva","MA - Penalva",{"v":2108306,"d":"21.08.3.06"}]
[null,"MA","Peri Mirim","MA - Peri Mirim",{"v":2108405,"d":"21.08.4.05"}]
[null,"MA","Peritoró","MA - Peritoró",{"v":2108454,"d":"21.08.4.54"}]
[null,"MA","Pindaré-Mirim","MA - Pindaré-Mirim",{"v":2108504,"d":"21.08.5.04"}]
[null,"MA","Pinheiro","MA - Pinheiro",{"v":2108603,"d":"21.08.6.03"}]
[null,"MA","Pio XII","MA - Pio XII",{"v":2108702,"d":"21.08.7.02"}]
[null,"MA","Pirapemas","MA - Pirapemas",{"v":2108801,"d":"21.08.8.01"}]
[null,"MA","Poção de Pedras","MA - Poção de Pedras",{"v":2108900,"d":"21.08.9.00"}]
[null,"MA","Porto Franco","MA - Porto Franco",{"v":2109007,"d":"21.09.0.07"}]
[null,"MA","Porto Rico do Maranhão",{"$f":"CONCATENATE(B1311,\" - \",C1311)","v":"MA - Porto Rico do Maranhão"},{"v":2109056,"d":"21.09.0.56"}]
[null,"MA","Presidente Dutra","MA - Presidente Dutra",{"v":2109106,"d":"21.09.1.06"}]
[null,"MA","Presidente Juscelino","MA - Presidente Juscelino",{"v":2109205,"d":"21.09.2.05"}]
[null,"MA","Presidente Médici","MA - Presidente Médici",{"v":2109239,"d":"21.09.2.39"}]
[null,"MA","Presidente Sarney","MA - Presidente Sarney",{"v":2109270,"d":"21.09.2.70"}]
[null,"MA","Presidente Vargas","MA - Presidente Vargas",{"v":2109304,"d":"21.09.3.04"}]
[null,"MA","Primeira Cruz","MA - Primeira Cruz",{"v":2109403,"d":"21.09.4.03"}]
[null,"MA","Raposa","MA - Raposa",{"v":2109452,"d":"21.09.4.52"}]
[null,"MA","Riachão","MA - Riachão",{"v":2109502,"d":"21.09.5.02"}]
[null,"MA","Ribamar Fiquene","MA - Ribamar Fiquene",{"v":2109551,"d":"21.09.5.51"}]
[null,"MA","Rosário","MA - Rosário",{"v":2109601,"d":"21.09.6.01"}]
[null,"MA","Sambaíba","MA - Sambaíba",{"v":2109700,"d":"21.09.7.00"}]
[null,"MA","Santa Filomena do Maranhão","MA - Santa Filomena do Maranhão",{"v":2109759,"d":"21.09.7.59"}]
[null,"MA","Santa Helena","MA - Santa Helena",{"v":2109809,"d":"21.09.8.09"}]
[null,"MA","Santa Inês","MA - Santa Inês",{"v":2109908,"d":"21.09.9.08"}]
[null,"MA","Santa Luzia","MA - Santa Luzia",{"v":2110005,"d":"21.10.0.05"}]
[null,"MA","Santa Luzia do Paruá","MA - Santa Luzia do Paruá",{"v":2110039,"d":"21.10.0.39"}]
[null,"MA","Santa Quitéria do Maranhão","MA - Santa Quitéria do Maranhão",{"v":2110104,"d":"21.10.1.04"}]
[null,"MA","Santa Rita","MA - Santa Rita",{"v":2110203,"d":"21.10.2.03"}]
[null,"MA","Santana do Maranhão","MA - Santana do Maranhão",{"v":2110237,"d":"21.10.2.37"}]
[null,"MA","Santo Amaro do Maranhão","MA - Santo Amaro do Maranhão",{"v":2110278,"d":"21.10.2.78"}]
[null,"MA","Santo Antônio dos Lopes","MA - Santo Antônio dos Lopes",{"v":2110302,"d":"21.10.3.02"}]
[null,"MA","São Benedito do Rio Preto","MA - São Benedito do Rio Preto",{"v":2110401,"d":"21.10.4.01"}]
[null,"MA","São Bento","MA - São Bento",{"v":2110500,"d":"21.10.5.00"}]
[null,"MA","São Bernardo","MA - São Bernardo",{"v":2110609,"d":"21.10.6.09"}]
[null,"MA","São Domingos do Azeitão","MA - São Domingos do Azeitão",{"v":2110658,"d":"21.10.6.58"}]
[null,"MA","São Domingos do Maranhão","MA - São Domingos do Maranhão",{"v":2110708,"d":"21.10.7.08"}]
[null,"MA","São Félix de Balsas","MA - São Félix de Balsas",{"v":2110807,"d":"21.10.8.07"}]
[null,"MA","São Francisco do Brejão","MA - São Francisco do Brejão",{"v":2110856,"d":"21.10.8.56"}]
[null,"MA","São Francisco do Maranhão","MA - São Francisco do Maranhão",{"v":2110906,"d":"21.10.9.06"}]
[null,"MA","São João Batista","MA - São João Batista",{"v":2111003,"d":"21.11.0.03"}]
[null,"MA","São João do Carú","MA - São João do Carú",{"v":2111029,"d":"21.11.0.29"}]
[null,"MA","São João do Paraíso","MA - São João do Paraíso",{"v":2111052,"d":"21.11.0.52"}]
[null,"MA","São João do Soter","MA - São João do Soter",{"v":2111078,"d":"21.11.0.78"}]
[null,"MA","São João dos Patos","MA - São João dos Patos",{"v":2111102,"d":"21.11.1.02"}]
[null,"MA","São José de Ribamar","MA - São José de Ribamar",{"v":2111201,"d":"21.11.2.01"}]
[null,"MA","São José dos Basílios","MA - São José dos Basílios",{"v":2111250,"d":"21.11.2.50"}]
[null,"MA","São Luís","MA - São Luís",{"v":2111300,"d":"21.11.3.00"}]
[null,"MA","São Luís Gonzaga do Maranhão","MA - São Luís Gonzaga do Maranhão",{"v":2111409,"d":"21.11.4.09"}]
[null,"MA","São Mateus do Maranhão","MA - São Mateus do Maranhão",{"v":2111508,"d":"21.11.5.08"}]
[null,"MA","São Pedro da Água Branca","MA - São Pedro da Água Branca",{"v":2111532,"d":"21.11.5.32"}]
[null,"MA","São Pedro dos Crentes","MA - São Pedro dos Crentes",{"v":2111573,"d":"21.11.5.73"}]
[null,"MA","São Raimundo das Mangabeiras","MA - São Raimundo das Mangabeiras",{"v":2111607,"d":"21.11.6.07"}]
[null,"MA","São Raimundo do Doca Bezerra","MA - São Raimundo do Doca Bezerra",{"v":2111631,"d":"21.11.6.31"}]
[null,"MA","São Roberto","MA - São Roberto",{"v":2111672,"d":"21.11.6.72"}]
[null,"MA","São Vicente Ferrer","MA - São Vicente Ferrer",{"v":2111706,"d":"21.11.7.06"}]
[null,"MA","Satubinha","MA - Satubinha",{"v":2111722,"d":"21.11.7.22"}]
[null,"MA","Senador Alexandre Costa","MA - Senador Alexandre Costa",{"v":2111748,"d":"21.11.7.48"}]
[null,"MA","Senador La Rocque","MA - Senador La Rocque",{"v":2111763,"d":"21.11.7.63"}]
[null,"MA","Serrano do Maranhão","MA - Serrano do Maranhão",{"v":2111789,"d":"21.11.7.89"}]
[null,"MA","Sítio Novo","MA - Sítio Novo",{"v":2111805,"d":"21.11.8.05"}]
[null,"MA","Sucupira do Norte","MA - Sucupira do Norte",{"v":2111904,"d":"21.11.9.04"}]
[null,"MA","Sucupira do Riachão","MA - Sucupira do Riachão",{"v":2111953,"d":"21.11.9.53"}]
[null,"MA","Tasso Fragoso","MA - Tasso Fragoso",{"v":2112001,"d":"21.12.0.01"}]
[null,"MA","Timbiras","MA - Timbiras",{"v":2112100,"d":"21.12.1.00"}]
[null,"MA","Timon","MA - Timon",{"v":2112209,"d":"21.12.2.09"}]
[null,"MA","Trizidela do Vale","MA - Trizidela do Vale",{"v":2112233,"d":"21.12.2.33"}]
[null,"MA","Tufilândia","MA - Tufilândia",{"v":2112274,"d":"21.12.2.74"}]
[null,"MA","Tuntum","MA - Tuntum",{"v":2112308,"d":"21.12.3.08"}]
[null,"MA","Turiaçu","MA - Turiaçu",{"v":2112407,"d":"21.12.4.07"}]
[null,"MA","Turilândia","MA - Turilândia",{"v":2112456,"d":"21.12.4.56"}]
[null,"MA","Tutóia","MA - Tutóia",{"v":2112506,"d":"21.12.5.06"}]
[null,"MA","Urbano Santos","MA - Urbano Santos",{"v":2112605,"d":"21.12.6.05"}]
[null,"MA","Vargem Grande","MA - Vargem Grande",{"v":2112704,"d":"21.12.7.04"}]
[null,"MA","Viana",{"$f":"CONCATENATE(B1375,\" - \",C1375)","v":"MA - Viana"},{"v":2112803,"d":"21.12.8.03"}]
[null,"MA","Vila Nova dos Martírios","MA - Vila Nova dos Martírios",{"v":2112852,"d":"21.12.8.52"}]
[null,"MA","Vitória do Mearim","MA - Vitória do Mearim",{"v":2112902,"d":"21.12.9.02"}]
[null,"MA","Vitorino Freire","MA - Vitorino Freire",{"v":2113009,"d":"21.13.0.09"}]
[null,"MA","Zé Doca","MA - Zé Doca",{"v":2114007,"d":"21.14.0.07"}]
[null,"MG","Abadia dos Dourados","MG - Abadia dos Dourados",{"v":3100104,"d":"31.00.1.04"}]
[null,"MG","Abaeté","MG - Abaeté",{"v":3100203,"d":"31.00.2.03"}]
[null,"MG","Abre Campo","MG - Abre Campo",{"v":3100302,"d":"31.00.3.02"}]
[null,"MG","Acaiaca","MG - Acaiaca",{"v":3100401,"d":"31.00.4.01"}]
[null,"MG","Açucena","MG - Açucena",{"v":3100500,"d":"31.00.5.00"}]
[null,"MG","Água Boa","MG - Água Boa",{"v":3100609,"d":"31.00.6.09"}]
[null,"MG","Água Comprida","MG - Água Comprida",{"v":3100708,"d":"31.00.7.08"}]
[null,"MG","Aguanil","MG - Aguanil",{"v":3100807,"d":"31.00.8.07"}]
[null,"MG","Águas Formosas","MG - Águas Formosas",{"v":3100906,"d":"31.00.9.06"}]
[null,"MG","Águas Vermelhas","MG - Águas Vermelhas",{"v":3101003,"d":"31.01.0.03"}]
[null,"MG","Aimorés","MG - Aimorés",{"v":3101102,"d":"31.01.1.02"}]
[null,"MG","Aiuruoca","MG - Aiuruoca",{"v":3101201,"d":"31.01.2.01"}]
[null,"MG","Alagoa","MG - Alagoa",{"v":3101300,"d":"31.01.3.00"}]
[null,"MG","Albertina","MG - Albertina",{"v":3101409,"d":"31.01.4.09"}]
[null,"MG","Além Paraíba","MG - Além Paraíba",{"v":3101508,"d":"31.01.5.08"}]
[null,"MG","Alfenas","MG - Alfenas",{"v":3101607,"d":"31.01.6.07"}]
[null,"MG","Alfredo Vasconcelos","MG - Alfredo Vasconcelos",{"v":3101631,"d":"31.01.6.31"}]
[null,"MG","Almenara","MG - Almenara",{"v":3101706,"d":"31.01.7.06"}]
[null,"MG","Alpercata","MG - Alpercata",{"v":3101805,"d":"31.01.8.05"}]
[null,"MG","Alpinópolis","MG - Alpinópolis",{"v":3101904,"d":"31.01.9.04"}]
[null,"MG","Alterosa","MG - Alterosa",{"v":3102001,"d":"31.02.0.01"}]
[null,"MG","Alto Caparaó","MG - Alto Caparaó",{"v":3102050,"d":"31.02.0.50"}]
[null,"MG","Alto Jequitibá","MG - Alto Jequitibá",{"v":3153509,"d":"31.53.5.09"}]
[null,"MG","Alto Rio Doce","MG - Alto Rio Doce",{"v":3102100,"d":"31.02.1.00"}]
[null,"MG","Alvarenga","MG - Alvarenga",{"v":3102209,"d":"31.02.2.09"}]
[null,"MG","Alvinópolis","MG - Alvinópolis",{"v":3102308,"d":"31.02.3.08"}]
[null,"MG","Alvorada de Minas","MG - Alvorada de Minas",{"v":3102407,"d":"31.02.4.07"}]
[null,"MG","Amparo do Serra","MG - Amparo do Serra",{"v":3102506,"d":"31.02.5.06"}]
[null,"MG","Andradas","MG - Andradas",{"v":3102605,"d":"31.02.6.05"}]
[null,"MG","Andrelândia","MG - Andrelândia",{"v":3102803,"d":"31.02.8.03"}]
[null,"MG","Angelândia","MG - Angelândia",{"v":3102852,"d":"31.02.8.52"}]
[null,"MG","Antônio Carlos","MG - Antônio Carlos",{"v":3102902,"d":"31.02.9.02"}]
[null,"MG","Antônio Dias","MG - Antônio Dias",{"v":3103009,"d":"31.03.0.09"}]
[null,"MG","Antônio Prado de Minas","MG - Antônio Prado de Minas",{"v":3103108,"d":"31.03.1.08"}]
[null,"MG","Araçaí","MG - Araçaí",{"v":3103207,"d":"31.03.2.07"}]
[null,"MG","Aracitaba","MG - Aracitaba",{"v":3103306,"d":"31.03.3.06"}]
[null,"MG","Araçuaí","MG - Araçuaí",{"v":3103405,"d":"31.03.4.05"}]
[null,"MG","Araguari","MG - Araguari",{"v":3103504,"d":"31.03.5.04"}]
[null,"MG","Arantina","MG - Arantina",{"v":3103603,"d":"31.03.6.03"}]
[null,"MG","Araponga","MG - Araponga",{"v":3103702,"d":"31.03.7.02"}]
[null,"MG","Araporã","MG - Araporã",{"v":3103751,"d":"31.03.7.51"}]
[null,"MG","Arapuá","MG - Arapuá",{"v":3103801,"d":"31.03.8.01"}]
[null,"MG","Araújos","MG - Araújos",{"v":3103900,"d":"31.03.9.00"}]
[null,"MG","Araxá","MG - Araxá",{"v":3104007,"d":"31.04.0.07"}]
[null,"MG","Arceburgo","MG - Arceburgo",{"v":3104106,"d":"31.04.1.06"}]
[null,"MG","Arcos","MG - Arcos",{"v":3104205,"d":"31.04.2.05"}]
[null,"MG","Areado","MG - Areado",{"v":3104304,"d":"31.04.3.04"}]
[null,"MG","Argirita","MG - Argirita",{"v":3104403,"d":"31.04.4.03"}]
[null,"MG","Aricanduva","MG - Aricanduva",{"v":3104452,"d":"31.04.4.52"}]
[null,"MG","Arinos","MG - Arinos",{"v":3104502,"d":"31.04.5.02"}]
[null,"MG","Astolfo Dutra","MG - Astolfo Dutra",{"v":3104601,"d":"31.04.6.01"}]
[null,"MG","Ataléia","MG - Ataléia",{"v":3104700,"d":"31.04.7.00"}]
[null,"MG","Augusto de Lima","MG - Augusto de Lima",{"v":3104809,"d":"31.04.8.09"}]
[null,"MG","Baependi","MG - Baependi",{"v":3104908,"d":"31.04.9.08"}]
[null,"MG","Baldim","MG - Baldim",{"v":3105004,"d":"31.05.0.04"}]
[null,"MG","Bambuí","MG - Bambuí",{"v":3105103,"d":"31.05.1.03"}]
[null,"MG","Bandeira","MG - Bandeira",{"v":3105202,"d":"31.05.2.02"}]
[null,"MG","Bandeira do Sul","MG - Bandeira do Sul",{"v":3105301,"d":"31.05.3.01"}]
[null,"MG","Barão de Cocais","MG - Barão de Cocais",{"v":3105400,"d":"31.05.4.00"}]
[null,"MG","Barão de Monte Alto",{"$f":"CONCATENATE(B1439,\" - \",C1439)","v":"MG - Barão de Monte Alto"},{"v":3105509,"d":"31.05.5.09"}]
[null,"MG","Barbacena","MG - Barbacena",{"v":3105608,"d":"31.05.6.08"}]
[null,"MG","Barra Longa","MG - Barra Longa",{"v":3105707,"d":"31.05.7.07"}]
[null,"MG","Barroso","MG - Barroso",{"v":3105905,"d":"31.05.9.05"}]
[null,"MG","Bela Vista de Minas","MG - Bela Vista de Minas",{"v":3106002,"d":"31.06.0.02"}]
[null,"MG","Belmiro Braga","MG - Belmiro Braga",{"v":3106101,"d":"31.06.1.01"}]
[null,"MG","Belo Horizonte","MG - Belo Horizonte",{"v":3106200,"d":"31.06.2.00"}]
[null,"MG","Belo Oriente","MG - Belo Oriente",{"v":3106309,"d":"31.06.3.09"}]
[null,"MG","Belo Vale","MG - Belo Vale",{"v":3106408,"d":"31.06.4.08"}]
[null,"MG","Berilo","MG - Berilo",{"v":3106507,"d":"31.06.5.07"}]
[null,"MG","Berizal","MG - Berizal",{"v":3106655,"d":"31.06.6.55"}]
[null,"MG","Bertópolis","MG - Bertópolis",{"v":3106606,"d":"31.06.6.06"}]
[null,"MG","Betim","MG - Betim",{"v":3106705,"d":"31.06.7.05"}]
[null,"MG","Bias Fortes","MG - Bias Fortes",{"v":3106804,"d":"31.06.8.04"}]
[null,"MG","Bicas","MG - Bicas",{"v":3106903,"d":"31.06.9.03"}]
[null,"MG","Biquinhas","MG - Biquinhas",{"v":3107000,"d":"31.07.0.00"}]
[null,"MG","Boa Esperança","MG - Boa Esperança",{"v":3107109,"d":"31.07.1.09"}]
[null,"MG","Bocaina de Minas","MG - Bocaina de Minas",{"v":3107208,"d":"31.07.2.08"}]
[null,"MG","Bocaiúva","MG - Bocaiúva",{"v":3107307,"d":"31.07.3.07"}]
[null,"MG","Bom Despacho","MG - Bom Despacho",{"v":3107406,"d":"31.07.4.06"}]
[null,"MG","Bom Jardim de Minas","MG - Bom Jardim de Minas",{"v":3107505,"d":"31.07.5.05"}]
[null,"MG","Bom Jesus da Penha","MG - Bom Jesus da Penha",{"v":3107604,"d":"31.07.6.04"}]
[null,"MG","Bom Jesus do Amparo","MG - Bom Jesus do Amparo",{"v":3107703,"d":"31.07.7.03"}]
[null,"MG","Bom Jesus do Galho","MG - Bom Jesus do Galho",{"v":3107802,"d":"31.07.8.02"}]
[null,"MG","Bom Repouso","MG - Bom Repouso",{"v":3107901,"d":"31.07.9.01"}]
[null,"MG","Bom Sucesso","MG - Bom Sucesso",{"v":3108008,"d":"31.08.0.08"}]
[null,"MG","Bonfim","MG - Bonfim",{"v":3108107,"d":"31.08.1.07"}]
[null,"MG","Bonfinópolis de Minas","MG - Bonfinópolis de Minas",{"v":3108206,"d":"31.08.2.06"}]
[null,"MG","Bonito de Minas","MG - Bonito de Minas",{"v":3108255,"d":"31.08.2.55"}]
[null,"MG","Borda da Mata","MG - Borda da Mata",{"v":3108305,"d":"31.08.3.05"}]
[null,"MG","Botelhos","MG - Botelhos",{"v":3108404,"d":"31.08.4.04"}]
[null,"MG","Botumirim","MG - Botumirim",{"v":3108503,"d":"31.08.5.03"}]
[null,"MG","Brás Pires","MG - Brás Pires",{"v":3108701,"d":"31.08.7.01"}]
[null,"MG","Brasilândia de Minas","MG - Brasilândia de Minas",{"v":3108552,"d":"31.08.5.52"}]
[null,"MG","Brasília de Minas","MG - Brasília de Minas",{"v":3108602,"d":"31.08.6.02"}]
[null,"MG","Brasópolis","MG - Brasópolis",{"v":3108909,"d":"31.08.9.09"}]
[null,"MG","Braúnas","MG - Braúnas",{"v":3108800,"d":"31.08.8.00"}]
[null,"MG","Brumadinho","MG - Brumadinho",{"v":3109006,"d":"31.09.0.06"}]
[null,"MG","Bueno Brandão","MG - Bueno Brandão",{"v":3109105,"d":"31.09.1.05"}]
[null,"MG","Buenópolis","MG - Buenópolis",{"v":3109204,"d":"31.09.2.04"}]
[null,"MG","Bugre","MG - Bugre",{"v":3109253,"d":"31.09.2.53"}]
[null,"MG","Buritis","MG - Buritis",{"v":3109303,"d":"31.09.3.03"}]
[null,"MG","Buritizeiro","MG - Buritizeiro",{"v":3109402,"d":"31.09.4.02"}]
[null,"MG","Cabeceira Grande","MG - Cabeceira Grande",{"v":3109451,"d":"31.09.4.51"}]
[null,"MG","Cabo Verde","MG - Cabo Verde",{"v":3109501,"d":"31.09.5.01"}]
[null,"MG","Cachoeira da Prata","MG - Cachoeira da Prata",{"v":3109600,"d":"31.09.6.00"}]
[null,"MG","Cachoeira de Minas","MG - Cachoeira de Minas",{"v":3109709,"d":"31.09.7.09"}]
[null,"MG","Cachoeira de Pajeú","MG - Cachoeira de Pajeú",{"v":3102704,"d":"31.02.7.04"}]
[null,"MG","Cachoeira Dourada","MG - Cachoeira Dourada",{"v":3109808,"d":"31.09.8.08"}]
[null,"MG","Caetanópolis","MG - Caetanópolis",{"v":3109907,"d":"31.09.9.07"}]
[null,"MG","Caeté","MG - Caeté",{"v":3110004,"d":"31.10.0.04"}]
[null,"MG","Caiana","MG - Caiana",{"v":3110103,"d":"31.10.1.03"}]
[null,"MG","Cajuri","MG - Cajuri",{"v":3110202,"d":"31.10.2.02"}]
[null,"MG","Caldas","MG - Caldas",{"v":3110301,"d":"31.10.3.01"}]
[null,"MG","Camacho","MG - Camacho",{"v":3110400,"d":"31.10.4.00"}]
[null,"MG","Camanducaia","MG - Camanducaia",{"v":3110509,"d":"31.10.5.09"}]
[null,"MG","Cambuí","MG - Cambuí",{"v":3110608,"d":"31.10.6.08"}]
[null,"MG","Cambuquira","MG - Cambuquira",{"v":3110707,"d":"31.10.7.07"}]
[null,"MG","Campanário","MG - Campanário",{"v":3110806,"d":"31.10.8.06"}]
[null,"MG","Campanha","MG - Campanha",{"v":3110905,"d":"31.10.9.05"}]
[null,"MG","Campestre","MG - Campestre",{"v":3111002,"d":"31.11.0.02"}]
[null,"MG","Campina Verde","MG - Campina Verde",{"v":3111101,"d":"31.11.1.01"}]
[null,"MG","Campo Azul","MG - Campo Azul",{"v":3111150,"d":"31.11.1.50"}]
[null,"MG","Campo Belo","MG - Campo Belo",{"v":3111200,"d":"31.11.2.00"}]
[null,"MG","Campo do Meio",{"$f":"CONCATENATE(B1503,\" - \",C1503)","v":"MG - Campo do Meio"},{"v":3111309,"d":"31.11.3.09"}]
[null,"MG","Campo Florido","MG - Campo Florido",{"v":3111408,"d":"31.11.4.08"}]
[null,"MG","Campos Altos","MG - Campos Altos",{"v":3111507,"d":"31.11.5.07"}]
[null,"MG","Campos Gerais","MG - Campos Gerais",{"v":3111606,"d":"31.11.6.06"}]
[null,"MG","Cana Verde","MG - Cana Verde",{"v":3111903,"d":"31.11.9.03"}]
[null,"MG","Canaã","MG - Canaã",{"v":3111705,"d":"31.11.7.05"}]
[null,"MG","Canápolis","MG - Canápolis",{"v":3111804,"d":"31.11.8.04"}]
[null,"MG","Candeias","MG - Candeias",{"v":3112000,"d":"31.12.0.00"}]
[null,"MG","Cantagalo","MG - Cantagalo",{"v":3112059,"d":"31.12.0.59"}]
[null,"MG","Caparaó","MG - Caparaó",{"v":3112109,"d":"31.12.1.09"}]
[null,"MG","Capela Nova","MG - Capela Nova",{"v":3112208,"d":"31.12.2.08"}]
[null,"MG","Capelinha","MG - Capelinha",{"v":3112307,"d":"31.12.3.07"}]
[null,"MG","Capetinga","MG - Capetinga",{"v":3112406,"d":"31.12.4.06"}]
[null,"MG","Capim Branco","MG - Capim Branco",{"v":3112505,"d":"31.12.5.05"}]
[null,"MG","Capinópolis","MG - Capinópolis",{"v":3112604,"d":"31.12.6.04"}]
[null,"MG","Capitão Andrade","MG - Capitão Andrade",{"v":3112653,"d":"31.12.6.53"}]
[null,"MG","Capitão Enéas","MG - Capitão Enéas",{"v":3112703,"d":"31.12.7.03"}]
[null,"MG","Capitólio","MG - Capitólio",{"v":3112802,"d":"31.12.8.02"}]
[null,"MG","Caputira","MG - Caputira",{"v":3112901,"d":"31.12.9.01"}]
[null,"MG","Caraí","MG - Caraí",{"v":3113008,"d":"31.13.0.08"}]
[null,"MG","Caranaíba","MG - Caranaíba",{"v":3113107,"d":"31.13.1.07"}]
[null,"MG","Carandaí","MG - Carandaí",{"v":3113206,"d":"31.13.2.06"}]
[null,"MG","Carangola","MG - Carangola",{"v":3113305,"d":"31.13.3.05"}]
[null,"MG","Caratinga","MG - Caratinga",{"v":3113404,"d":"31.13.4.04"}]
[null,"MG","Carbonita","MG - Carbonita",{"v":3113503,"d":"31.13.5.03"}]
[null,"MG","Careaçu","MG - Careaçu",{"v":3113602,"d":"31.13.6.02"}]
[null,"MG","Carlos Chagas","MG - Carlos Chagas",{"v":3113701,"d":"31.13.7.01"}]
[null,"MG","Carmésia","MG - Carmésia",{"v":3113800,"d":"31.13.8.00"}]
[null,"MG","Carmo da Cachoeira","MG - Carmo da Cachoeira",{"v":3113909,"d":"31.13.9.09"}]
[null,"MG","Carmo da Mata","MG - Carmo da Mata",{"v":3114006,"d":"31.14.0.06"}]
[null,"MG","Carmo de Minas","MG - Carmo de Minas",{"v":3114105,"d":"31.14.1.05"}]
[null,"MG","Carmo do Cajuru","MG - Carmo do Cajuru",{"v":3114204,"d":"31.14.2.04"}]
[null,"MG","Carmo do Paranaíba","MG - Carmo do Paranaíba",{"v":3114303,"d":"31.14.3.03"}]
[null,"MG","Carmo do Rio Claro","MG - Carmo do Rio Claro",{"v":3114402,"d":"31.14.4.02"}]
[null,"MG","Carmópolis de Minas","MG - Carmópolis de Minas",{"v":3114501,"d":"31.14.5.01"}]
[null,"MG","Carneirinho","MG - Carneirinho",{"v":3114550,"d":"31.14.5.50"}]
[null,"MG","Carrancas","MG - Carrancas",{"v":3114600,"d":"31.14.6.00"}]
[null,"MG","Carvalhópolis","MG - Carvalhópolis",{"v":3114709,"d":"31.14.7.09"}]
[null,"MG","Carvalhos","MG - Carvalhos",{"v":3114808,"d":"31.14.8.08"}]
[null,"MG","Casa Grande","MG - Casa Grande",{"v":3114907,"d":"31.14.9.07"}]
[null,"MG","Cascalho Rico","MG - Cascalho Rico",{"v":3115003,"d":"31.15.0.03"}]
[null,"MG","Cássia","MG - Cássia",{"v":3115102,"d":"31.15.1.02"}]
[null,"MG","Cataguases","MG - Cataguases",{"v":3115300,"d":"31.15.3.00"}]
[null,"MG","Catas Altas","MG - Catas Altas",{"v":3115359,"d":"31.15.3.59"}]
[null,"MG","Catas Altas da Noruega","MG - Catas Altas da Noruega",{"v":3115409,"d":"31.15.4.09"}]
[null,"MG","Catuji","MG - Catuji",{"v":3115458,"d":"31.15.4.58"}]
[null,"MG","Catuti","MG - Catuti",{"v":3115474,"d":"31.15.4.74"}]
[null,"MG","Caxambu","MG - Caxambu",{"v":3115508,"d":"31.15.5.08"}]
[null,"MG","Cedro do Abaeté","MG - Cedro do Abaeté",{"v":3115607,"d":"31.15.6.07"}]
[null,"MG","Central de Minas","MG - Central de Minas",{"v":3115706,"d":"31.15.7.06"}]
[null,"MG","Centralina","MG - Centralina",{"v":3115805,"d":"31.15.8.05"}]
[null,"MG","Chácara","MG - Chácara",{"v":3115904,"d":"31.15.9.04"}]
[null,"MG","Chalé","MG - Chalé",{"v":3116001,"d":"31.16.0.01"}]
[null,"MG","Chapada do Norte","MG - Chapada do Norte",{"v":3116100,"d":"31.16.1.00"}]
[null,"MG","Chapada Gaúcha","MG - Chapada Gaúcha",{"v":3116159,"d":"31.16.1.59"}]
[null,"MG","Chiador","MG - Chiador",{"v":3116209,"d":"31.16.2.09"}]
[null,"MG","Cipotânea","MG - Cipotânea",{"v":3116308,"d":"31.16.3.08"}]
[null,"MG","Claraval","MG - Claraval",{"v":3116407,"d":"31.16.4.07"}]
[null,"MG","Claro dos Poções","MG - Claro dos Poções",{"v":3116506,"d":"31.16.5.06"}]
[null,"MG","Cláudio","MG - Cláudio",{"v":3116605,"d":"31.16.6.05"}]
[null,"MG","Coimbra","MG - Coimbra",{"v":3116704,"d":"31.16.7.04"}]
[null,"MG","Coluna","MG - Coluna",{"v":3116803,"d":"31.16.8.03"}]
[null,"MG","Comendador Gomes","MG - Comendador Gomes",{"v":3116902,"d":"31.16.9.02"}]
[null,"MG","Comercinho","MG - Comercinho",{"v":3117009,"d":"31.17.0.09"}]
[null,"MG","Conceição da Aparecida",{"$f":"CONCATENATE(B1567,\" - \",C1567)","v":"MG - Conceição da Aparecida"},{"v":3117108,"d":"31.17.1.08"}]
[null,"MG","Conceição da Barra de Minas","MG - Conceição da Barra de Minas",{"v":3115201,"d":"31.15.2.01"}]
[null,"MG","Conceição das Alagoas","MG - Conceição das Alagoas",{"v":3117306,"d":"31.17.3.06"}]
[null,"MG","Conceição das Pedras","MG - Conceição das Pedras",{"v":3117207,"d":"31.17.2.07"}]
[null,"MG","Conceição de Ipanema","MG - Conceição de Ipanema",{"v":3117405,"d":"31.17.4.05"}]
[null,"MG","Conceição do Mato Dentro","MG - Conceição do Mato Dentro",{"v":3117504,"d":"31.17.5.04"}]
[null,"MG","Conceição do Pará","MG - Conceição do Pará",{"v":3117603,"d":"31.17.6.03"}]
[null,"MG","Conceição do Rio Verde","MG - Conceição do Rio Verde",{"v":3117702,"d":"31.17.7.02"}]
[null,"MG","Conceição dos Ouros","MG - Conceição dos Ouros",{"v":3117801,"d":"31.17.8.01"}]
[null,"MG","Cônego Marinho","MG - Cônego Marinho",{"v":3117836,"d":"31.17.8.36"}]
[null,"MG","Confins","MG - Confins",{"v":3117876,"d":"31.17.8.76"}]
[null,"MG","Congonhal","MG - Congonhal",{"v":3117900,"d":"31.17.9.00"}]
[null,"MG","Congonhas","MG - Congonhas",{"v":3118007,"d":"31.18.0.07"}]
[null,"MG","Congonhas do Norte","MG - Congonhas do Norte",{"v":3118106,"d":"31.18.1.06"}]
[null,"MG","Conquista","MG - Conquista",{"v":3118205,"d":"31.18.2.05"}]
[null,"MG","Conselheiro Lafaiete","MG - Conselheiro Lafaiete",{"v":3118304,"d":"31.18.3.04"}]
[null,"MG","Conselheiro Pena","MG - Conselheiro Pena",{"v":3118403,"d":"31.18.4.03"}]
[null,"MG","Consolação","MG - Consolação",{"v":3118502,"d":"31.18.5.02"}]
[null,"MG","Contagem","MG - Contagem",{"v":3118601,"d":"31.18.6.01"}]
[null,"MG","Coqueiral","MG - Coqueiral",{"v":3118700,"d":"31.18.7.00"}]
[null,"MG","Coração de Jesus","MG - Coração de Jesus",{"v":3118809,"d":"31.18.8.09"}]
[null,"MG","Cordisburgo","MG - Cordisburgo",{"v":3118908,"d":"31.18.9.08"}]
[null,"MG","Cordislândia","MG - Cordislândia",{"v":3119005,"d":"31.19.0.05"}]
[null,"MG","Corinto","MG - Corinto",{"v":3119104,"d":"31.19.1.04"}]
[null,"MG","Coroaci","MG - Coroaci",{"v":3119203,"d":"31.19.2.03"}]
[null,"MG","Coromandel","MG - Coromandel",{"v":3119302,"d":"31.19.3.02"}]
[null,"MG","Coronel Fabriciano","MG - Coronel Fabriciano",{"v":3119401,"d":"31.19.4.01"}]
[null,"MG","Coronel Murta","MG - Coronel Murta",{"v":3119500,"d":"31.19.5.00"}]
[null,"MG","Coronel Pacheco","MG - Coronel Pacheco",{"v":3119609,"d":"31.19.6.09"}]
[null,"MG","Coronel Xavier Chaves","MG - Coronel Xavier Chaves",{"v":3119708,"d":"31.19.7.08"}]
[null,"MG","Córrego Danta","MG - Córrego Danta",{"v":3119807,"d":"31.19.8.07"}]
[null,"MG","Córrego do Bom Jesus","MG - Córrego do Bom Jesus",{"v":3119906,"d":"31.19.9.06"}]
[null,"MG","Córrego Fundo","MG - Córrego Fundo",{"v":3119955,"d":"31.19.9.55"}]
[null,"MG","Córrego Novo","MG - Córrego Novo",{"v":3120003,"d":"31.20.0.03"}]
[null,"MG","Couto de Magalhães de Minas","MG - Couto de Magalhães de Minas",{"v":3120102,"d":"31.20.1.02"}]
[null,"MG","Crisólita","MG - Crisólita",{"v":3120151,"d":"31.20.1.51"}]
[null,"MG","Cristais","MG - Cristais",{"v":3120201,"d":"31.20.2.01"}]
[null,"MG","Cristália","MG - Cristália",{"v":3120300,"d":"31.20.3.00"}]
[null,"MG","Cristiano Otoni","MG - Cristiano Otoni",{"v":3120409,"d":"31.20.4.09"}]
[null,"MG","Cristina","MG - Cristina",{"v":3120508,"d":"31.20.5.08"}]
[null,"MG","Crucilândia","MG - Crucilândia",{"v":3120607,"d":"31.20.6.07"}]
[null,"MG","Cruzeiro da Fortaleza","MG - Cruzeiro da Fortaleza",{"v":3120706,"d":"31.20.7.06"}]
[null,"MG","Cruzília","MG - Cruzília",{"v":3120805,"d":"31.20.8.05"}]
[null,"MG","Cuparaque","MG - Cuparaque",{"v":3120839,"d":"31.20.8.39"}]
[null,"MG","Curral de Dentro","MG - Curral de Dentro",{"v":3120870,"d":"31.20.8.70"}]
[null,"MG","Curvelo","MG - Curvelo",{"v":3120904,"d":"31.20.9.04"}]
[null,"MG","Datas","MG - Datas",{"v":3121001,"d":"31.21.0.01"}]
[null,"MG","Delfim Moreira","MG - Delfim Moreira",{"v":3121100,"d":"31.21.1.00"}]
[null,"MG","Delfinópolis","MG - Delfinópolis",{"v":3121209,"d":"31.21.2.09"}]
[null,"MG","Delta","MG - Delta",{"v":3121258,"d":"31.21.2.58"}]
[null,"MG","Descoberto","MG - Descoberto",{"v":3121308,"d":"31.21.3.08"}]
[null,"MG","Desterro de Entre Rios","MG - Desterro de Entre Rios",{"v":3121407,"d":"31.21.4.07"}]
[null,"MG","Desterro do Melo","MG - Desterro do Melo",{"v":3121506,"d":"31.21.5.06"}]
[null,"MG","Diamantina","MG - Diamantina",{"v":3121605,"d":"31.21.6.05"}]
[null,"MG","Diogo de Vasconcelos","MG - Diogo de Vasconcelos",{"v":3121704,"d":"31.21.7.04"}]
[null,"MG","Dionísio","MG - Dionísio",{"v":3121803,"d":"31.21.8.03"}]
[null,"MG","Divinésia","MG - Divinésia",{"v":3121902,"d":"31.21.9.02"}]
[null,"MG","Divino","MG - Divino",{"v":3122009,"d":"31.22.0.09"}]
[null,"MG","Divino das Laranjeiras","MG - Divino das Laranjeiras",{"v":3122108,"d":"31.22.1.08"}]
[null,"MG","Divinolândia de Minas","MG - Divinolândia de Minas",{"v":3122207,"d":"31.22.2.07"}]
[null,"MG","Divinópolis","MG - Divinópolis",{"v":3122306,"d":"31.22.3.06"}]
[null,"MG","Divisa Alegre","MG - Divisa Alegre",{"v":3122355,"d":"31.22.3.55"}]
[null,"MG","Divisa Nova","MG - Divisa Nova",{"v":3122405,"d":"31.22.4.05"}]
[null,"MG","Divisópolis","MG - Divisópolis",{"v":3122454,"d":"31.22.4.54"}]
[null,"MG","Dom Bosco",{"$f":"CONCATENATE(B1631,\" - \",C1631)","v":"MG - Dom Bosco"},{"v":3122470,"d":"31.22.4.70"}]
[null,"MG","Dom Cavati","MG - Dom Cavati",{"v":3122504,"d":"31.22.5.04"}]
[null,"MG","Dom Joaquim","MG - Dom Joaquim",{"v":3122603,"d":"31.22.6.03"}]
[null,"MG","Dom Silvério","MG - Dom Silvério",{"v":3122702,"d":"31.22.7.02"}]
[null,"MG","Dom Viçoso","MG - Dom Viçoso",{"v":3122801,"d":"31.22.8.01"}]
[null,"MG","Dona Eusébia","MG - Dona Eusébia",{"v":3122900,"d":"31.22.9.00"}]
[null,"MG","Dores de Campos","MG - Dores de Campos",{"v":3123007,"d":"31.23.0.07"}]
[null,"MG","Dores de Guanhães","MG - Dores de Guanhães",{"v":3123106,"d":"31.23.1.06"}]
[null,"MG","Dores do Indaiá","MG - Dores do Indaiá",{"v":3123205,"d":"31.23.2.05"}]
[null,"MG","Dores do Turvo","MG - Dores do Turvo",{"v":3123304,"d":"31.23.3.04"}]
[null,"MG","Doresópolis","MG - Doresópolis",{"v":3123403,"d":"31.23.4.03"}]
[null,"MG","Douradoquara","MG - Douradoquara",{"v":3123502,"d":"31.23.5.02"}]
[null,"MG","Durandé","MG - Durandé",{"v":3123528,"d":"31.23.5.28"}]
[null,"MG","Elói Mendes","MG - Elói Mendes",{"v":3123601,"d":"31.23.6.01"}]
[null,"MG","Engenheiro Caldas","MG - Engenheiro Caldas",{"v":3123700,"d":"31.23.7.00"}]
[null,"MG","Engenheiro Navarro","MG - Engenheiro Navarro",{"v":3123809,"d":"31.23.8.09"}]
[null,"MG","Entre Folhas","MG - Entre Folhas",{"v":3123858,"d":"31.23.8.58"}]
[null,"MG","Entre Rios de Minas","MG - Entre Rios de Minas",{"v":3123908,"d":"31.23.9.08"}]
[null,"MG","Ervália","MG - Ervália",{"v":3124005,"d":"31.24.0.05"}]
[null,"MG","Esmeraldas","MG - Esmeraldas",{"v":3124104,"d":"31.24.1.04"}]
[null,"MG","Espera Feliz","MG - Espera Feliz",{"v":3124203,"d":"31.24.2.03"}]
[null,"MG","Espinosa","MG - Espinosa",{"v":3124302,"d":"31.24.3.02"}]
[null,"MG","Espírito Santo do Dourado","MG - Espírito Santo do Dourado",{"v":3124401,"d":"31.24.4.01"}]
[null,"MG","Estiva","MG - Estiva",{"v":3124500,"d":"31.24.5.00"}]
[null,"MG","Estrela Dalva","MG - Estrela Dalva",{"v":3124609,"d":"31.24.6.09"}]
[null,"MG","Estrela do Indaiá","MG - Estrela do Indaiá",{"v":3124708,"d":"31.24.7.08"}]
[null,"MG","Estrela do Sul","MG - Estrela do Sul",{"v":3124807,"d":"31.24.8.07"}]
[null,"MG","Eugenópolis","MG - Eugenópolis",{"v":3124906,"d":"31.24.9.06"}]
[null,"MG","Ewbank da Câmara","MG - Ewbank da Câmara",{"v":3125002,"d":"31.25.0.02"}]
[null,"MG","Extrema","MG - Extrema",{"v":3125101,"d":"31.25.1.01"}]
[null,"MG","Fama","MG - Fama",{"v":3125200,"d":"31.25.2.00"}]
[null,"MG","Faria Lemos","MG - Faria Lemos",{"v":3125309,"d":"31.25.3.09"}]
[null,"MG","Felício dos Santos","MG - Felício dos Santos",{"v":3125408,"d":"31.25.4.08"}]
[null,"MG","Felisburgo","MG - Felisburgo",{"v":3125606,"d":"31.25.6.06"}]
[null,"MG","Felixlândia","MG - Felixlândia",{"v":3125705,"d":"31.25.7.05"}]
[null,"MG","Fernandes Tourinho","MG - Fernandes Tourinho",{"v":3125804,"d":"31.25.8.04"}]
[null,"MG","Ferros","MG - Ferros",{"v":3125903,"d":"31.25.9.03"}]
[null,"MG","Fervedouro","MG - Fervedouro",{"v":3125952,"d":"31.25.9.52"}]
[null,"MG","Florestal","MG - Florestal",{"v":3126000,"d":"31.26.0.00"}]
[null,"MG","Formiga","MG - Formiga",{"v":3126109,"d":"31.26.1.09"}]
[null,"MG","Formoso","MG - Formoso",{"v":3126208,"d":"31.26.2.08"}]
[null,"MG","Fortaleza de Minas","MG - Fortaleza de Minas",{"v":3126307,"d":"31.26.3.07"}]
[null,"MG","Fortuna de Minas","MG - Fortuna de Minas",{"v":3126406,"d":"31.26.4.06"}]
[null,"MG","Francisco Badaró","MG - Francisco Badaró",{"v":3126505,"d":"31.26.5.05"}]
[null,"MG","Francisco Dumont","MG - Francisco Dumont",{"v":3126604,"d":"31.26.6.04"}]
[null,"MG","Francisco Sá","MG - Francisco Sá",{"v":3126703,"d":"31.26.7.03"}]
[null,"MG","Franciscópolis","MG - Franciscópolis",{"v":3126752,"d":"31.26.7.52"}]
[null,"MG","Frei Gaspar","MG - Frei Gaspar",{"v":3126802,"d":"31.26.8.02"}]
[null,"MG","Frei Inocêncio","MG - Frei Inocêncio",{"v":3126901,"d":"31.26.9.01"}]
[null,"MG","Frei Lagonegro","MG - Frei Lagonegro",{"v":3126950,"d":"31.26.9.50"}]
[null,"MG","Fronteira","MG - Fronteira",{"v":3127008,"d":"31.27.0.08"}]
[null,"MG","Fronteira dos Vales","MG - Fronteira dos Vales",{"v":3127057,"d":"31.27.0.57"}]
[null,"MG","Fruta de Leite","MG - Fruta de Leite",{"v":3127073,"d":"31.27.0.73"}]
[null,"MG","Frutal","MG - Frutal",{"v":3127107,"d":"31.27.1.07"}]
[null,"MG","Funilândia","MG - Funilândia",{"v":3127206,"d":"31.27.2.06"}]
[null,"MG","Galiléia","MG - Galiléia",{"v":3127305,"d":"31.27.3.05"}]
[null,"MG","Gameleiras","MG - Gameleiras",{"v":3127339,"d":"31.27.3.39"}]
[null,"MG","Glaucilândia","MG - Glaucilândia",{"v":3127354,"d":"31.27.3.54"}]
[null,"MG","Goiabeira","MG - Goiabeira",{"v":3127370,"d":"31.27.3.70"}]
[null,"MG","Goianá","MG - Goianá",{"v":3127388,"d":"31.27.3.88"}]
[null,"MG","Gonçalves","MG - Gonçalves",{"v":3127404,"d":"31.27.4.04"}]
[null,"MG","Gonzaga","MG - Gonzaga",{"v":3127503,"d":"31.27.5.03"}]
[null,"MG","Gouveia","MG - Gouveia",{"v":3127602,"d":"31.27.6.02"}]
[null,"MG","Governador Valadares","MG - Governador Valadares",{"v":3127701,"d":"31.27.7.01"}]
[null,"MG","Grão Mogol",{"$f":"CONCATENATE(B1695,\" - \",C1695)","v":"MG - Grão Mogol"},{"v":3127800,"d":"31.27.8.00"}]
[null,"MG","Grupiara","MG - Grupiara",{"v":3127909,"d":"31.27.9.09"}]
[null,"MG","Guanhães","MG - Guanhães",{"v":3128006,"d":"31.28.0.06"}]
[null,"MG","Guapé","MG - Guapé",{"v":3128105,"d":"31.28.1.05"}]
[null,"MG","Guaraciaba","MG - Guaraciaba",{"v":3128204,"d":"31.28.2.04"}]
[null,"MG","Guaraciama","MG - Guaraciama",{"v":3128253,"d":"31.28.2.53"}]
[null,"MG","Guaranésia","MG - Guaranésia",{"v":3128303,"d":"31.28.3.03"}]
[null,"MG","Guarani","MG - Guarani",{"v":3128402,"d":"31.28.4.02"}]
[null,"MG","Guarará","MG - Guarará",{"v":3128501,"d":"31.28.5.01"}]
[null,"MG","Guarda-Mor","MG - Guarda-Mor",{"v":3128600,"d":"31.28.6.00"}]
[null,"MG","Guaxupé","MG - Guaxupé",{"v":3128709,"d":"31.28.7.09"}]
[null,"MG","Guidoval","MG - Guidoval",{"v":3128808,"d":"31.28.8.08"}]
[null,"MG","Guimarânia","MG - Guimarânia",{"v":3128907,"d":"31.28.9.07"}]
[null,"MG","Guiricema","MG - Guiricema",{"v":3129004,"d":"31.29.0.04"}]
[null,"MG","Gurinhatã","MG - Gurinhatã",{"v":3129103,"d":"31.29.1.03"}]
[null,"MG","Heliodora","MG - Heliodora",{"v":3129202,"d":"31.29.2.02"}]
[null,"MG","Iapu","MG - Iapu",{"v":3129301,"d":"31.29.3.01"}]
[null,"MG","Ibertioga","MG - Ibertioga",{"v":3129400,"d":"31.29.4.00"}]
[null,"MG","Ibiá","MG - Ibiá",{"v":3129509,"d":"31.29.5.09"}]
[null,"MG","Ibiaí","MG - Ibiaí",{"v":3129608,"d":"31.29.6.08"}]
[null,"MG","Ibiracatu","MG - Ibiracatu",{"v":3129657,"d":"31.29.6.57"}]
[null,"MG","Ibiraci","MG - Ibiraci",{"v":3129707,"d":"31.29.7.07"}]
[null,"MG","Ibirité","MG - Ibirité",{"v":3129806,"d":"31.29.8.06"}]
[null,"MG","Ibitiúra de Minas","MG - Ibitiúra de Minas",{"v":3129905,"d":"31.29.9.05"}]
[null,"MG","Ibituruna","MG - Ibituruna",{"v":3130002,"d":"31.30.0.02"}]
[null,"MG","Icaraí de Minas","MG - Icaraí de Minas",{"v":3130051,"d":"31.30.0.51"}]
[null,"MG","Igarapé","MG - Igarapé",{"v":3130101,"d":"31.30.1.01"}]
[null,"MG","Igaratinga","MG - Igaratinga",{"v":3130200,"d":"31.30.2.00"}]
[null,"MG","Iguatama","MG - Iguatama",{"v":3130309,"d":"31.30.3.09"}]
[null,"MG","Ijaci","MG - Ijaci",{"v":3130408,"d":"31.30.4.08"}]
[null,"MG","Ilicínea","MG - Ilicínea",{"v":3130507,"d":"31.30.5.07"}]
[null,"MG","Imbé de Minas","MG - Imbé de Minas",{"v":3130556,"d":"31.30.5.56"}]
[null,"MG","Inconfidentes","MG - Inconfidentes",{"v":3130606,"d":"31.30.6.06"}]
[null,"MG","Indaiabira","MG - Indaiabira",{"v":3130655,"d":"31.30.6.55"}]
[null,"MG","Indianópolis","MG - Indianópolis",{"v":3130705,"d":"31.30.7.05"}]
[null,"MG","Ingaí","MG - Ingaí",{"v":3130804,"d":"31.30.8.04"}]
[null,"MG","Inhapim","MG - Inhapim",{"v":3130903,"d":"31.30.9.03"}]
[null,"MG","Inhaúma","MG - Inhaúma",{"v":3131000,"d":"31.31.0.00"}]
[null,"MG","Inimutaba","MG - Inimutaba",{"v":3131109,"d":"31.31.1.09"}]
[null,"MG","Ipaba","MG - Ipaba",{"v":3131158,"d":"31.31.1.58"}]
[null,"MG","Ipanema","MG - Ipanema",{"v":3131208,"d":"31.31.2.08"}]
[null,"MG","Ipatinga","MG - Ipatinga",{"v":3131307,"d":"31.31.3.07"}]
[null,"MG","Ipiaçu","MG - Ipiaçu",{"v":3131406,"d":"31.31.4.06"}]
[null,"MG","Ipuiúna","MG - Ipuiúna",{"v":3131505,"d":"31.31.5.05"}]
[null,"MG","Iraí de Minas","MG - Iraí de Minas",{"v":3131604,"d":"31.31.6.04"}]
[null,"MG","Itabira","MG - Itabira",{"v":3131703,"d":"31.31.7.03"}]
[null,"MG","Itabirinha","MG - Itabirinha",{"v":3131802,"d":"31.31.8.02"}]
[null,"MG","Itabirito","MG - Itabirito",{"v":3131901,"d":"31.31.9.01"}]
[null,"MG","Itacambira","MG - Itacambira",{"v":3132008,"d":"31.32.0.08"}]
[null,"MG","Itacarambi","MG - Itacarambi",{"v":3132107,"d":"31.32.1.07"}]
[null,"MG","Itaguara","MG - Itaguara",{"v":3132206,"d":"31.32.2.06"}]
[null,"MG","Itaipé","MG - Itaipé",{"v":3132305,"d":"31.32.3.05"}]
[null,"MG","Itajubá","MG - Itajubá",{"v":3132404,"d":"31.32.4.04"}]
[null,"MG","Itamarandiba","MG - Itamarandiba",{"v":3132503,"d":"31.32.5.03"}]
[null,"MG","Itamarati de Minas","MG - Itamarati de Minas",{"v":3132602,"d":"31.32.6.02"}]
[null,"MG","Itambacuri","MG - Itambacuri",{"v":3132701,"d":"31.32.7.01"}]
[null,"MG","Itambé do Mato Dentro","MG - Itambé do Mato Dentro",{"v":3132800,"d":"31.32.8.00"}]
[null,"MG","Itamogi","MG - Itamogi",{"v":3132909,"d":"31.32.9.09"}]
[null,"MG","Itamonte","MG - Itamonte",{"v":3133006,"d":"31.33.0.06"}]
[null,"MG","Itanhandu","MG - Itanhandu",{"v":3133105,"d":"31.33.1.05"}]
[null,"MG","Itanhomi","MG - Itanhomi",{"v":3133204,"d":"31.33.2.04"}]
[null,"MG","Itaobim","MG - Itaobim",{"v":3133303,"d":"31.33.3.03"}]
[null,"MG","Itapagipe","MG - Itapagipe",{"v":3133402,"d":"31.33.4.02"}]
[null,"MG","Itapecerica","MG - Itapecerica",{"v":3133501,"d":"31.33.5.01"}]
[null,"MG","Itapeva",{"$f":"CONCATENATE(B1759,\" - \",C1759)","v":"MG - Itapeva"},{"v":3133600,"d":"31.33.6.00"}]
[null,"MG","Itatiaiuçu","MG - Itatiaiuçu",{"v":3133709,"d":"31.33.7.09"}]
[null,"MG","Itaú de Minas","MG - Itaú de Minas",{"v":3133758,"d":"31.33.7.58"}]
[null,"MG","Itaúna","MG - Itaúna",{"v":3133808,"d":"31.33.8.08"}]
[null,"MG","Itaverava","MG - Itaverava",{"v":3133907,"d":"31.33.9.07"}]
[null,"MG","Itinga","MG - Itinga",{"v":3134004,"d":"31.34.0.04"}]
[null,"MG","Itueta","MG - Itueta",{"v":3134103,"d":"31.34.1.03"}]
[null,"MG","Ituiutaba","MG - Ituiutaba",{"v":3134202,"d":"31.34.2.02"}]
[null,"MG","Itumirim","MG - Itumirim",{"v":3134301,"d":"31.34.3.01"}]
[null,"MG","Iturama","MG - Iturama",{"v":3134400,"d":"31.34.4.00"}]
[null,"MG","Itutinga","MG - Itutinga",{"v":3134509,"d":"31.34.5.09"}]
[null,"MG","Jaboticatubas","MG - Jaboticatubas",{"v":3134608,"d":"31.34.6.08"}]
[null,"MG","Jacinto","MG - Jacinto",{"v":3134707,"d":"31.34.7.07"}]
[null,"MG","Jacuí","MG - Jacuí",{"v":3134806,"d":"31.34.8.06"}]
[null,"MG","Jacutinga","MG - Jacutinga",{"v":3134905,"d":"31.34.9.05"}]
[null,"MG","Jaguaraçu","MG - Jaguaraçu",{"v":3135001,"d":"31.35.0.01"}]
[null,"MG","Jaíba","MG - Jaíba",{"v":3135050,"d":"31.35.0.50"}]
[null,"MG","Jampruca","MG - Jampruca",{"v":3135076,"d":"31.35.0.76"}]
[null,"MG","Janaúba","MG - Janaúba",{"v":3135100,"d":"31.35.1.00"}]
[null,"MG","Januária","MG - Januária",{"v":3135209,"d":"31.35.2.09"}]
[null,"MG","Japaraíba","MG - Japaraíba",{"v":3135308,"d":"31.35.3.08"}]
[null,"MG","Japonvar","MG - Japonvar",{"v":3135357,"d":"31.35.3.57"}]
[null,"MG","Jeceaba","MG - Jeceaba",{"v":3135407,"d":"31.35.4.07"}]
[null,"MG","Jenipapo de Minas","MG - Jenipapo de Minas",{"v":3135456,"d":"31.35.4.56"}]
[null,"MG","Jequeri","MG - Jequeri",{"v":3135506,"d":"31.35.5.06"}]
[null,"MG","Jequitaí","MG - Jequitaí",{"v":3135605,"d":"31.35.6.05"}]
[null,"MG","Jequitibá","MG - Jequitibá",{"v":3135704,"d":"31.35.7.04"}]
[null,"MG","Jequitinhonha","MG - Jequitinhonha",{"v":3135803,"d":"31.35.8.03"}]
[null,"MG","Jesuânia","MG - Jesuânia",{"v":3135902,"d":"31.35.9.02"}]
[null,"MG","Joaíma","MG - Joaíma",{"v":3136009,"d":"31.36.0.09"}]
[null,"MG","Joanésia","MG - Joanésia",{"v":3136108,"d":"31.36.1.08"}]
[null,"MG","João Monlevade","MG - João Monlevade",{"v":3136207,"d":"31.36.2.07"}]
[null,"MG","João Pinheiro","MG - João Pinheiro",{"v":3136306,"d":"31.36.3.06"}]
[null,"MG","Joaquim Felício","MG - Joaquim Felício",{"v":3136405,"d":"31.36.4.05"}]
[null,"MG","Jordânia","MG - Jordânia",{"v":3136504,"d":"31.36.5.04"}]
[null,"MG","José Gonçalves de Minas","MG - José Gonçalves de Minas",{"v":3136520,"d":"31.36.5.20"}]
[null,"MG","José Raydan","MG - José Raydan",{"v":3136553,"d":"31.36.5.53"}]
[null,"MG","Josenópolis","MG - Josenópolis",{"v":3136579,"d":"31.36.5.79"}]
[null,"MG","Juatuba","MG - Juatuba",{"v":3136652,"d":"31.36.6.52"}]
[null,"MG","Juiz de Fora","MG - Juiz de Fora",{"v":3136702,"d":"31.36.7.02"}]
[null,"MG","Juramento","MG - Juramento",{"v":3136801,"d":"31.36.8.01"}]
[null,"MG","Juruaia","MG - Juruaia",{"v":3136900,"d":"31.36.9.00"}]
[null,"MG","Juvenília","MG - Juvenília",{"v":3136959,"d":"31.36.9.59"}]
[null,"MG","Ladainha","MG - Ladainha",{"v":3137007,"d":"31.37.0.07"}]
[null,"MG","Lagamar","MG - Lagamar",{"v":3137106,"d":"31.37.1.06"}]
[null,"MG","Lagoa da Prata","MG - Lagoa da Prata",{"v":3137205,"d":"31.37.2.05"}]
[null,"MG","Lagoa dos Patos","MG - Lagoa dos Patos",{"v":3137304,"d":"31.37.3.04"}]
[null,"MG","Lagoa Dourada","MG - Lagoa Dourada",{"v":3137403,"d":"31.37.4.03"}]
[null,"MG","Lagoa Formosa","MG - Lagoa Formosa",{"v":3137502,"d":"31.37.5.02"}]
[null,"MG","Lagoa Grande","MG - Lagoa Grande",{"v":3137536,"d":"31.37.5.36"}]
[null,"MG","Lagoa Santa","MG - Lagoa Santa",{"v":3137601,"d":"31.37.6.01"}]
[null,"MG","Lajinha","MG - Lajinha",{"v":3137700,"d":"31.37.7.00"}]
[null,"MG","Lambari","MG - Lambari",{"v":3137809,"d":"31.37.8.09"}]
[null,"MG","Lamim","MG - Lamim",{"v":3137908,"d":"31.37.9.08"}]
[null,"MG","Laranjal","MG - Laranjal",{"v":3138005,"d":"31.38.0.05"}]
[null,"MG","Lassance","MG - Lassance",{"v":3138104,"d":"31.38.1.04"}]
[null,"MG","Lavras","MG - Lavras",{"v":3138203,"d":"31.38.2.03"}]
[null,"MG","Leandro Ferreira","MG - Leandro Ferreira",{"v":3138302,"d":"31.38.3.02"}]
[null,"MG","Leme do Prado","MG - Leme do Prado",{"v":3138351,"d":"31.38.3.51"}]
[null,"MG","Leopoldina","MG - Leopoldina",{"v":3138401,"d":"31.38.4.01"}]
[null,"MG","Liberdade","MG - Liberdade",{"v":3138500,"d":"31.38.5.00"}]
[null,"MG","Lima Duarte","MG - Lima Duarte",{"v":3138609,"d":"31.38.6.09"}]
[null,"MG","Limeira do Oeste","MG - Limeira do Oeste",{"v":3138625,"d":"31.38.6.25"}]
[null,"MG","Lontra","MG - Lontra",{"v":3138658,"d":"31.38.6.58"}]
[null,"MG","Luisburgo",{"$f":"CONCATENATE(B1823,\" - \",C1823)","v":"MG - Luisburgo"},{"v":3138674,"d":"31.38.6.74"}]
[null,"MG","Luislândia","MG - Luislândia",{"v":3138682,"d":"31.38.6.82"}]
[null,"MG","Luminárias","MG - Luminárias",{"v":3138708,"d":"31.38.7.08"}]
[null,"MG","Luz","MG - Luz",{"v":3138807,"d":"31.38.8.07"}]
[null,"MG","Machacalis","MG - Machacalis",{"v":3138906,"d":"31.38.9.06"}]
[null,"MG","Machado","MG - Machado",{"v":3139003,"d":"31.39.0.03"}]
[null,"MG","Madre de Deus de Minas","MG - Madre de Deus de Minas",{"v":3139102,"d":"31.39.1.02"}]
[null,"MG","Malacacheta","MG - Malacacheta",{"v":3139201,"d":"31.39.2.01"}]
[null,"MG","Mamonas","MG - Mamonas",{"v":3139250,"d":"31.39.2.50"}]
[null,"MG","Manga","MG - Manga",{"v":3139300,"d":"31.39.3.00"}]
[null,"MG","Manhuaçu","MG - Manhuaçu",{"v":3139409,"d":"31.39.4.09"}]
[null,"MG","Manhumirim","MG - Manhumirim",{"v":3139508,"d":"31.39.5.08"}]
[null,"MG","Mantena","MG - Mantena",{"v":3139607,"d":"31.39.6.07"}]
[null,"MG","Mar de Espanha","MG - Mar de Espanha",{"v":3139805,"d":"31.39.8.05"}]
[null,"MG","Maravilhas","MG - Maravilhas",{"v":3139706,"d":"31.39.7.06"}]
[null,"MG","Maria da Fé","MG - Maria da Fé",{"v":3139904,"d":"31.39.9.04"}]
[null,"MG","Mariana","MG - Mariana",{"v":3140001,"d":"31.40.0.01"}]
[null,"MG","Marilac","MG - Marilac",{"v":3140100,"d":"31.40.1.00"}]
[null,"MG","Mário Campos","MG - Mário Campos",{"v":3140159,"d":"31.40.1.59"}]
[null,"MG","Maripá de Minas","MG - Maripá de Minas",{"v":3140209,"d":"31.40.2.09"}]
[null,"MG","Marliéria","MG - Marliéria",{"v":3140308,"d":"31.40.3.08"}]
[null,"MG","Marmelópolis","MG - Marmelópolis",{"v":3140407,"d":"31.40.4.07"}]
[null,"MG","Martinho Campos","MG - Martinho Campos",{"v":3140506,"d":"31.40.5.06"}]
[null,"MG","Martins Soares","MG - Martins Soares",{"v":3140530,"d":"31.40.5.30"}]
[null,"MG","Mata Verde","MG - Mata Verde",{"v":3140555,"d":"31.40.5.55"}]
[null,"MG","Materlândia","MG - Materlândia",{"v":3140605,"d":"31.40.6.05"}]
[null,"MG","Mateus Leme","MG - Mateus Leme",{"v":3140704,"d":"31.40.7.04"}]
[null,"MG","Mathias Lobato","MG - Mathias Lobato",{"v":3171501,"d":"31.71.5.01"}]
[null,"MG","Matias Barbosa","MG - Matias Barbosa",{"v":3140803,"d":"31.40.8.03"}]
[null,"MG","Matias Cardoso","MG - Matias Cardoso",{"v":3140852,"d":"31.40.8.52"}]
[null,"MG","Matipó","MG - Matipó",{"v":3140902,"d":"31.40.9.02"}]
[null,"MG","Mato Verde","MG - Mato Verde",{"v":3141009,"d":"31.41.0.09"}]
[null,"MG","Matozinhos","MG - Matozinhos",{"v":3141108,"d":"31.41.1.08"}]
[null,"MG","Matutina","MG - Matutina",{"v":3141207,"d":"31.41.2.07"}]
[null,"MG","Medeiros","MG - Medeiros",{"v":3141306,"d":"31.41.3.06"}]
[null,"MG","Medina","MG - Medina",{"v":3141405,"d":"31.41.4.05"}]
[null,"MG","Mendes Pimentel","MG - Mendes Pimentel",{"v":3141504,"d":"31.41.5.04"}]
[null,"MG","Mercês","MG - Mercês",{"v":3141603,"d":"31.41.6.03"}]
[null,"MG","Mesquita","MG - Mesquita",{"v":3141702,"d":"31.41.7.02"}]
[null,"MG","Minas Novas","MG - Minas Novas",{"v":3141801,"d":"31.41.8.01"}]
[null,"MG","Minduri","MG - Minduri",{"v":3141900,"d":"31.41.9.00"}]
[null,"MG","Mirabela","MG - Mirabela",{"v":3142007,"d":"31.42.0.07"}]
[null,"MG","Miradouro","MG - Miradouro",{"v":3142106,"d":"31.42.1.06"}]
[null,"MG","Miraí","MG - Miraí",{"v":3142205,"d":"31.42.2.05"}]
[null,"MG","Miravânia","MG - Miravânia",{"v":3142254,"d":"31.42.2.54"}]
[null,"MG","Moeda","MG - Moeda",{"v":3142304,"d":"31.42.3.04"}]
[null,"MG","Moema","MG - Moema",{"v":3142403,"d":"31.42.4.03"}]
[null,"MG","Monjolos","MG - Monjolos",{"v":3142502,"d":"31.42.5.02"}]
[null,"MG","Monsenhor Paulo","MG - Monsenhor Paulo",{"v":3142601,"d":"31.42.6.01"}]
[null,"MG","Montalvânia","MG - Montalvânia",{"v":3142700,"d":"31.42.7.00"}]
[null,"MG","Monte Alegre de Minas","MG - Monte Alegre de Minas",{"v":3142809,"d":"31.42.8.09"}]
[null,"MG","Monte Azul","MG - Monte Azul",{"v":3142908,"d":"31.42.9.08"}]
[null,"MG","Monte Belo","MG - Monte Belo",{"v":3143005,"d":"31.43.0.05"}]
[null,"MG","Monte Carmelo","MG - Monte Carmelo",{"v":3143104,"d":"31.43.1.04"}]
[null,"MG","Monte Formoso","MG - Monte Formoso",{"v":3143153,"d":"31.43.1.53"}]
[null,"MG","Monte Santo de Minas","MG - Monte Santo de Minas",{"v":3143203,"d":"31.43.2.03"}]
[null,"MG","Monte Sião","MG - Monte Sião",{"v":3143401,"d":"31.43.4.01"}]
[null,"MG","Montes Claros","MG - Montes Claros",{"v":3143302,"d":"31.43.3.02"}]
[null,"MG","Montezuma","MG - Montezuma",{"v":3143450,"d":"31.43.4.50"}]
[null,"MG","Morada Nova de Minas","MG - Morada Nova de Minas",{"v":3143500,"d":"31.43.5.00"}]
[null,"MG","Morro da Garça","MG - Morro da Garça",{"v":3143609,"d":"31.43.6.09"}]
[null,"MG","Morro do Pilar","MG - Morro do Pilar",{"v":3143708,"d":"31.43.7.08"}]
[null,"MG","Munhoz","MG - Munhoz",{"v":3143807,"d":"31.43.8.07"}]
[null,"MG","Muriaé","MG - Muriaé",{"v":3143906,"d":"31.43.9.06"}]
[null,"MG","Mutum",{"$f":"CONCATENATE(B1887,\" - \",C1887)","v":"MG - Mutum"},{"v":3144003,"d":"31.44.0.03"}]
[null,"MG","Muzambinho","MG - Muzambinho",{"v":3144102,"d":"31.44.1.02"}]
[null,"MG","Nacip Raydan","MG - Nacip Raydan",{"v":3144201,"d":"31.44.2.01"}]
[null,"MG","Nanuque","MG - Nanuque",{"v":3144300,"d":"31.44.3.00"}]
[null,"MG","Naque","MG - Naque",{"v":3144359,"d":"31.44.3.59"}]
[null,"MG","Natalândia","MG - Natalândia",{"v":3144375,"d":"31.44.3.75"}]
[null,"MG","Natércia","MG - Natércia",{"v":3144409,"d":"31.44.4.09"}]
[null,"MG","Nazareno","MG - Nazareno",{"v":3144508,"d":"31.44.5.08"}]
[null,"MG","Nepomuceno","MG - Nepomuceno",{"v":3144607,"d":"31.44.6.07"}]
[null,"MG","Ninheira","MG - Ninheira",{"v":3144656,"d":"31.44.6.56"}]
[null,"MG","Nova Belém","MG - Nova Belém",{"v":3144672,"d":"31.44.6.72"}]
[null,"MG","Nova Era","MG - Nova Era",{"v":3144706,"d":"31.44.7.06"}]
[null,"MG","Nova Lima","MG - Nova Lima",{"v":3144805,"d":"31.44.8.05"}]
[null,"MG","Nova Módica","MG - Nova Módica",{"v":3144904,"d":"31.44.9.04"}]
[null,"MG","Nova Ponte","MG - Nova Ponte",{"v":3145000,"d":"31.45.0.00"}]
[null,"MG","Nova Porteirinha","MG - Nova Porteirinha",{"v":3145059,"d":"31.45.0.59"}]
[null,"MG","Nova Resende","MG - Nova Resende",{"v":3145109,"d":"31.45.1.09"}]
[null,"MG","Nova Serrana","MG - Nova Serrana",{"v":3145208,"d":"31.45.2.08"}]
[null,"MG","Nova União","MG - Nova União",{"v":3136603,"d":"31.36.6.03"}]
[null,"MG","Novo Cruzeiro","MG - Novo Cruzeiro",{"v":3145307,"d":"31.45.3.07"}]
[null,"MG","Novo Oriente de Minas","MG - Novo Oriente de Minas",{"v":3145356,"d":"31.45.3.56"}]
[null,"MG","Novorizonte","MG - Novorizonte",{"v":3145372,"d":"31.45.3.72"}]
[null,"MG","Olaria","MG - Olaria",{"v":3145406,"d":"31.45.4.06"}]
[null,"MG","Olhos-d'Água","MG - Olhos-d'Água",{"v":3145455,"d":"31.45.4.55"}]
[null,"MG","Olímpio Noronha","MG - Olímpio Noronha",{"v":3145505,"d":"31.45.5.05"}]
[null,"MG","Oliveira","MG - Oliveira",{"v":3145604,"d":"31.45.6.04"}]
[null,"MG","Oliveira Fortes","MG - Oliveira Fortes",{"v":3145703,"d":"31.45.7.03"}]
[null,"MG","Onça de Pitangui","MG - Onça de Pitangui",{"v":3145802,"d":"31.45.8.02"}]
[null,"MG","Oratórios","MG - Oratórios",{"v":3145851,"d":"31.45.8.51"}]
[null,"MG","Orizânia","MG - Orizânia",{"v":3145877,"d":"31.45.8.77"}]
[null,"MG","Ouro Branco","MG - Ouro Branco",{"v":3145901,"d":"31.45.9.01"}]
[null,"MG","Ouro Fino","MG - Ouro Fino",{"v":3146008,"d":"31.46.0.08"}]
[null,"MG","Ouro Preto","MG - Ouro Preto",{"v":3146107,"d":"31.46.1.07"}]
[null,"MG","Ouro Verde de Minas","MG - Ouro Verde de Minas",{"v":3146206,"d":"31.46.2.06"}]
[null,"MG","Padre Carvalho","MG - Padre Carvalho",{"v":3146255,"d":"31.46.2.55"}]
[null,"MG","Padre Paraíso","MG - Padre Paraíso",{"v":3146305,"d":"31.46.3.05"}]
[null,"MG","Pai Pedro","MG - Pai Pedro",{"v":3146552,"d":"31.46.5.52"}]
[null,"MG","Paineiras","MG - Paineiras",{"v":3146404,"d":"31.46.4.04"}]
[null,"MG","Pains","MG - Pains",{"v":3146503,"d":"31.46.5.03"}]
[null,"MG","Paiva","MG - Paiva",{"v":3146602,"d":"31.46.6.02"}]
[null,"MG","Palma","MG - Palma",{"v":3146701,"d":"31.46.7.01"}]
[null,"MG","Palmópolis","MG - Palmópolis",{"v":3146750,"d":"31.46.7.50"}]
[null,"MG","Papagaios","MG - Papagaios",{"v":3146909,"d":"31.46.9.09"}]
[null,"MG","Pará de Minas","MG - Pará de Minas",{"v":3147105,"d":"31.47.1.05"}]
[null,"MG","Paracatu","MG - Paracatu",{"v":3147006,"d":"31.47.0.06"}]
[null,"MG","Paraguaçu","MG - Paraguaçu",{"v":3147204,"d":"31.47.2.04"}]
[null,"MG","Paraisópolis","MG - Paraisópolis",{"v":3147303,"d":"31.47.3.03"}]
[null,"MG","Paraopeba","MG - Paraopeba",{"v":3147402,"d":"31.47.4.02"}]
[null,"MG","Passa Quatro","MG - Passa Quatro",{"v":3147600,"d":"31.47.6.00"}]
[null,"MG","Passa Tempo","MG - Passa Tempo",{"v":3147709,"d":"31.47.7.09"}]
[null,"MG","Passabém","MG - Passabém",{"v":3147501,"d":"31.47.5.01"}]
[null,"MG","Passa-Vinte","MG - Passa-Vinte",{"v":3147808,"d":"31.47.8.08"}]
[null,"MG","Passos","MG - Passos",{"v":3147907,"d":"31.47.9.07"}]
[null,"MG","Patis","MG - Patis",{"v":3147956,"d":"31.47.9.56"}]
[null,"MG","Patos de Minas","MG - Patos de Minas",{"v":3148004,"d":"31.48.0.04"}]
[null,"MG","Patrocínio","MG - Patrocínio",{"v":3148103,"d":"31.48.1.03"}]
[null,"MG","Patrocínio do Muriaé","MG - Patrocínio do Muriaé",{"v":3148202,"d":"31.48.2.02"}]
[null,"MG","Paula Cândido","MG - Paula Cândido",{"v":3148301,"d":"31.48.3.01"}]
[null,"MG","Paulistas","MG - Paulistas",{"v":3148400,"d":"31.48.4.00"}]
[null,"MG","Pavão","MG - Pavão",{"v":3148509,"d":"31.48.5.09"}]
[null,"MG","Peçanha","MG - Peçanha",{"v":3148608,"d":"31.48.6.08"}]
[null,"MG","Pedra Azul","MG - Pedra Azul",{"v":3148707,"d":"31.48.7.07"}]
[null,"MG","Pedra Bonita","MG - Pedra Bonita",{"v":3148756,"d":"31.48.7.56"}]
[null,"MG","Pedra do Anta","MG - Pedra do Anta",{"v":3148806,"d":"31.48.8.06"}]
[null,"MG","Pedra do Indaiá",{"$f":"CONCATENATE(B1951,\" - \",C1951)","v":"MG - Pedra do Indaiá"},{"v":3148905,"d":"31.48.9.05"}]
[null,"MG","Pedra Dourada","MG - Pedra Dourada",{"v":3149002,"d":"31.49.0.02"}]
[null,"MG","Pedralva","MG - Pedralva",{"v":3149101,"d":"31.49.1.01"}]
[null,"MG","Pedras de Maria da Cruz","MG - Pedras de Maria da Cruz",{"v":3149150,"d":"31.49.1.50"}]
[null,"MG","Pedrinópolis","MG - Pedrinópolis",{"v":3149200,"d":"31.49.2.00"}]
[null,"MG","Pedro Leopoldo","MG - Pedro Leopoldo",{"v":3149309,"d":"31.49.3.09"}]
[null,"MG","Pedro Teixeira","MG - Pedro Teixeira",{"v":3149408,"d":"31.49.4.08"}]
[null,"MG","Pequeri","MG - Pequeri",{"v":3149507,"d":"31.49.5.07"}]
[null,"MG","Pequi","MG - Pequi",{"v":3149606,"d":"31.49.6.06"}]
[null,"MG","Perdigão","MG - Perdigão",{"v":3149705,"d":"31.49.7.05"}]
[null,"MG","Perdizes","MG - Perdizes",{"v":3149804,"d":"31.49.8.04"}]
[null,"MG","Perdões","MG - Perdões",{"v":3149903,"d":"31.49.9.03"}]
[null,"MG","Periquito","MG - Periquito",{"v":3149952,"d":"31.49.9.52"}]
[null,"MG","Pescador","MG - Pescador",{"v":3150000,"d":"31.50.0.00"}]
[null,"MG","Piau","MG - Piau",{"v":3150109,"d":"31.50.1.09"}]
[null,"MG","Piedade de Caratinga","MG - Piedade de Caratinga",{"v":3150158,"d":"31.50.1.58"}]
[null,"MG","Piedade de Ponte Nova","MG - Piedade de Ponte Nova",{"v":3150208,"d":"31.50.2.08"}]
[null,"MG","Piedade do Rio Grande","MG - Piedade do Rio Grande",{"v":3150307,"d":"31.50.3.07"}]
[null,"MG","Piedade dos Gerais","MG - Piedade dos Gerais",{"v":3150406,"d":"31.50.4.06"}]
[null,"MG","Pimenta","MG - Pimenta",{"v":3150505,"d":"31.50.5.05"}]
[null,"MG","Pingo-d'Água","MG - Pingo-d'Água",{"v":3150539,"d":"31.50.5.39"}]
[null,"MG","Pintópolis","MG - Pintópolis",{"v":3150570,"d":"31.50.5.70"}]
[null,"MG","Piracema","MG - Piracema",{"v":3150604,"d":"31.50.6.04"}]
[null,"MG","Pirajuba","MG - Pirajuba",{"v":3150703,"d":"31.50.7.03"}]
[null,"MG","Piranga","MG - Piranga",{"v":3150802,"d":"31.50.8.02"}]
[null,"MG","Piranguçu","MG - Piranguçu",{"v":3150901,"d":"31.50.9.01"}]
[null,"MG","Piranguinho","MG - Piranguinho",{"v":3151008,"d":"31.51.0.08"}]
[null,"MG","Pirapetinga","MG - Pirapetinga",{"v":3151107,"d":"31.51.1.07"}]
[null,"MG","Pirapora","MG - Pirapora",{"v":3151206,"d":"31.51.2.06"}]
[null,"MG","Piraúba","MG - Piraúba",{"v":3151305,"d":"31.51.3.05"}]
[null,"MG","Pitangui","MG - Pitangui",{"v":3151404,"d":"31.51.4.04"}]
[null,"MG","Piumhi","MG - Piumhi",{"v":3151503,"d":"31.51.5.03"}]
[null,"MG","Planura","MG - Planura",{"v":3151602,"d":"31.51.6.02"}]
[null,"MG","Poço Fundo","MG - Poço Fundo",{"v":3151701,"d":"31.51.7.01"}]
[null,"MG","Poços de Caldas","MG - Poços de Caldas",{"v":3151800,"d":"31.51.8.00"}]
[null,"MG","Pocrane","MG - Pocrane",{"v":3151909,"d":"31.51.9.09"}]
[null,"MG","Pompéu","MG - Pompéu",{"v":3152006,"d":"31.52.0.06"}]
[null,"MG","Ponte Nova","MG - Ponte Nova",{"v":3152105,"d":"31.52.1.05"}]
[null,"MG","Ponto Chique","MG - Ponto Chique",{"v":3152131,"d":"31.52.1.31"}]
[null,"MG","Ponto dos Volantes","MG - Ponto dos Volantes",{"v":3152170,"d":"31.52.1.70"}]
[null,"MG","Porteirinha","MG - Porteirinha",{"v":3152204,"d":"31.52.2.04"}]
[null,"MG","Porto Firme","MG - Porto Firme",{"v":3152303,"d":"31.52.3.03"}]
[null,"MG","Poté","MG - Poté",{"v":3152402,"d":"31.52.4.02"}]
[null,"MG","Pouso Alegre","MG - Pouso Alegre",{"v":3152501,"d":"31.52.5.01"}]
[null,"MG","Pouso Alto","MG - Pouso Alto",{"v":3152600,"d":"31.52.6.00"}]
[null,"MG","Prados","MG - Prados",{"v":3152709,"d":"31.52.7.09"}]
[null,"MG","Prata","MG - Prata",{"v":3152808,"d":"31.52.8.08"}]
[null,"MG","Pratápolis","MG - Pratápolis",{"v":3152907,"d":"31.52.9.07"}]
[null,"MG","Pratinha","MG - Pratinha",{"v":3153004,"d":"31.53.0.04"}]
[null,"MG","Presidente Bernardes","MG - Presidente Bernardes",{"v":3153103,"d":"31.53.1.03"}]
[null,"MG","Presidente Juscelino","MG - Presidente Juscelino",{"v":3153202,"d":"31.53.2.02"}]
[null,"MG","Presidente Kubitschek","MG - Presidente Kubitschek",{"v":3153301,"d":"31.53.3.01"}]
[null,"MG","Presidente Olegário","MG - Presidente Olegário",{"v":3153400,"d":"31.53.4.00"}]
[null,"MG","Prudente de Morais","MG - Prudente de Morais",{"v":3153608,"d":"31.53.6.08"}]
[null,"MG","Quartel Geral","MG - Quartel Geral",{"v":3153707,"d":"31.53.7.07"}]
[null,"MG","Queluzito","MG - Queluzito",{"v":3153806,"d":"31.53.8.06"}]
[null,"MG","Raposos","MG - Raposos",{"v":3153905,"d":"31.53.9.05"}]
[null,"MG","Raul Soares","MG - Raul Soares",{"v":3154002,"d":"31.54.0.02"}]
[null,"MG","Recreio","MG - Recreio",{"v":3154101,"d":"31.54.1.01"}]
[null,"MG","Reduto","MG - Reduto",{"v":3154150,"d":"31.54.1.50"}]
[null,"MG","Resende Costa","MG - Resende Costa",{"v":3154200,"d":"31.54.2.00"}]
[null,"MG","Resplendor","MG - Resplendor",{"v":3154309,"d":"31.54.3.09"}]
[null,"MG","Ressaquinha","MG - Ressaquinha",{"v":3154408,"d":"31.54.4.08"}]
[null,"MG","Riachinho","MG - Riachinho",{"v":3154457,"d":"31.54.4.57"}]
[null,"MG","Riacho dos Machados",{"$f":"CONCATENATE(B2015,\" - \",C2015)","v":"MG - Riacho dos Machados"},{"v":3154507,"d":"31.54.5.07"}]
[null,"MG","Ribeirão das Neves","MG - Ribeirão das Neves",{"v":3154606,"d":"31.54.6.06"}]
[null,"MG","Ribeirão Vermelho","MG - Ribeirão Vermelho",{"v":3154705,"d":"31.54.7.05"}]
[null,"MG","Rio Acima","MG - Rio Acima",{"v":3154804,"d":"31.54.8.04"}]
[null,"MG","Rio Casca","MG - Rio Casca",{"v":3154903,"d":"31.54.9.03"}]
[null,"MG","Rio do Prado","MG - Rio do Prado",{"v":3155108,"d":"31.55.1.08"}]
[null,"MG","Rio Doce","MG - Rio Doce",{"v":3155009,"d":"31.55.0.09"}]
[null,"MG","Rio Espera","MG - Rio Espera",{"v":3155207,"d":"31.55.2.07"}]
[null,"MG","Rio Manso","MG - Rio Manso",{"v":3155306,"d":"31.55.3.06"}]
[null,"MG","Rio Novo","MG - Rio Novo",{"v":3155405,"d":"31.55.4.05"}]
[null,"MG","Rio Paranaíba","MG - Rio Paranaíba",{"v":3155504,"d":"31.55.5.04"}]
[null,"MG","Rio Pardo de Minas","MG - Rio Pardo de Minas",{"v":3155603,"d":"31.55.6.03"}]
[null,"MG","Rio Piracicaba","MG - Rio Piracicaba",{"v":3155702,"d":"31.55.7.02"}]
[null,"MG","Rio Pomba","MG - Rio Pomba",{"v":3155801,"d":"31.55.8.01"}]
[null,"MG","Rio Preto","MG - Rio Preto",{"v":3155900,"d":"31.55.9.00"}]
[null,"MG","Rio Vermelho","MG - Rio Vermelho",{"v":3156007,"d":"31.56.0.07"}]
[null,"MG","Ritápolis","MG - Ritápolis",{"v":3156106,"d":"31.56.1.06"}]
[null,"MG","Rochedo de Minas","MG - Rochedo de Minas",{"v":3156205,"d":"31.56.2.05"}]
[null,"MG","Rodeiro","MG - Rodeiro",{"v":3156304,"d":"31.56.3.04"}]
[null,"MG","Romaria","MG - Romaria",{"v":3156403,"d":"31.56.4.03"}]
[null,"MG","Rosário da Limeira","MG - Rosário da Limeira",{"v":3156452,"d":"31.56.4.52"}]
[null,"MG","Rubelita","MG - Rubelita",{"v":3156502,"d":"31.56.5.02"}]
[null,"MG","Rubim","MG - Rubim",{"v":3156601,"d":"31.56.6.01"}]
[null,"MG","Sabará","MG - Sabará",{"v":3156700,"d":"31.56.7.00"}]
[null,"MG","Sabinópolis","MG - Sabinópolis",{"v":3156809,"d":"31.56.8.09"}]
[null,"MG","Sacramento","MG - Sacramento",{"v":3156908,"d":"31.56.9.08"}]
[null,"MG","Salinas","MG - Salinas",{"v":3157005,"d":"31.57.0.05"}]
[null,"MG","Salto da Divisa","MG - Salto da Divisa",{"v":3157104,"d":"31.57.1.04"}]
[null,"MG","Santa Bárbara","MG - Santa Bárbara",{"v":3157203,"d":"31.57.2.03"}]
[null,"MG","Santa Bárbara do Leste","MG - Santa Bárbara do Leste",{"v":3157252,"d":"31.57.2.52"}]
[null,"MG","Santa Bárbara do Monte Verde","MG - Santa Bárbara do Monte Verde",{"v":3157278,"d":"31.57.2.78"}]
[null,"MG","Santa Bárbara do Tugúrio","MG - Santa Bárbara do Tugúrio",{"v":3157302,"d":"31.57.3.02"}]
[null,"MG","Santa Cruz de Minas","MG - Santa Cruz de Minas",{"v":3157336,"d":"31.57.3.36"}]
[null,"MG","Santa Cruz de Salinas","MG - Santa Cruz de Salinas",{"v":3157377,"d":"31.57.3.77"}]
[null,"MG","Santa Cruz do Escalvado","MG - Santa Cruz do Escalvado",{"v":3157401,"d":"31.57.4.01"}]
[null,"MG","Santa Efigênia de Minas","MG - Santa Efigênia de Minas",{"v":3157500,"d":"31.57.5.00"}]
[null,"MG","Santa Fé de Minas","MG - Santa Fé de Minas",{"v":3157609,"d":"31.57.6.09"}]
[null,"MG","Santa Helena de Minas","MG - Santa Helena de Minas",{"v":3157658,"d":"31.57.6.58"}]
[null,"MG","Santa Juliana","MG - Santa Juliana",{"v":3157708,"d":"31.57.7.08"}]
[null,"MG","Santa Luzia","MG - Santa Luzia",{"v":3157807,"d":"31.57.8.07"}]
[null,"MG","Santa Margarida","MG - Santa Margarida",{"v":3157906,"d":"31.57.9.06"}]
[null,"MG","Santa Maria de Itabira","MG - Santa Maria de Itabira",{"v":3158003,"d":"31.58.0.03"}]
[null,"MG","Santa Maria do Salto","MG - Santa Maria do Salto",{"v":3158102,"d":"31.58.1.02"}]
[null,"MG","Santa Maria do Suaçuí","MG - Santa Maria do Suaçuí",{"v":3158201,"d":"31.58.2.01"}]
[null,"MG","Santa Rita de Caldas","MG - Santa Rita de Caldas",{"v":3159209,"d":"31.59.2.09"}]
[null,"MG","Santa Rita de Ibitipoca","MG - Santa Rita de Ibitipoca",{"v":3159407,"d":"31.59.4.07"}]
[null,"MG","Santa Rita de Jacutinga","MG - Santa Rita de Jacutinga",{"v":3159308,"d":"31.59.3.08"}]
[null,"MG","Santa Rita de Minas","MG - Santa Rita de Minas",{"v":3159357,"d":"31.59.3.57"}]
[null,"MG","Santa Rita do Itueto","MG - Santa Rita do Itueto",{"v":3159506,"d":"31.59.5.06"}]
[null,"MG","Santa Rita do Sapucaí","MG - Santa Rita do Sapucaí",{"v":3159605,"d":"31.59.6.05"}]
[null,"MG","Santa Rosa da Serra","MG - Santa Rosa da Serra",{"v":3159704,"d":"31.59.7.04"}]
[null,"MG","Santa Vitória","MG - Santa Vitória",{"v":3159803,"d":"31.59.8.03"}]
[null,"MG","Santana da Vargem","MG - Santana da Vargem",{"v":3158300,"d":"31.58.3.00"}]
[null,"MG","Santana de Cataguases","MG - Santana de Cataguases",{"v":3158409,"d":"31.58.4.09"}]
[null,"MG","Santana de Pirapama","MG - Santana de Pirapama",{"v":3158508,"d":"31.58.5.08"}]
[null,"MG","Santana do Deserto","MG - Santana do Deserto",{"v":3158607,"d":"31.58.6.07"}]
[null,"MG","Santana do Garambéu","MG - Santana do Garambéu",{"v":3158706,"d":"31.58.7.06"}]
[null,"MG","Santana do Jacaré","MG - Santana do Jacaré",{"v":3158805,"d":"31.58.8.05"}]
[null,"MG","Santana do Manhuaçu","MG - Santana do Manhuaçu",{"v":3158904,"d":"31.58.9.04"}]
[null,"MG","Santana do Paraíso","MG - Santana do Paraíso",{"v":3158953,"d":"31.58.9.53"}]
[null,"MG","Santana do Riacho","MG - Santana do Riacho",{"v":3159001,"d":"31.59.0.01"}]
[null,"MG","Santana dos Montes","MG - Santana dos Montes",{"v":3159100,"d":"31.59.1.00"}]
[null,"MG","Santo Antônio do Amparo","MG - Santo Antônio do Amparo",{"v":3159902,"d":"31.59.9.02"}]
[null,"MG","Santo Antônio do Aventureiro","MG - Santo Antônio do Aventureiro",{"v":3160009,"d":"31.60.0.09"}]
[null,"MG","Santo Antônio do Grama",{"$f":"CONCATENATE(B2079,\" - \",C2079)","v":"MG - Santo Antônio do Grama"},{"v":3160108,"d":"31.60.1.08"}]
[null,"MG","Santo Antônio do Itambé","MG - Santo Antônio do Itambé",{"v":3160207,"d":"31.60.2.07"}]
[null,"MG","Santo Antônio do Jacinto","MG - Santo Antônio do Jacinto",{"v":3160306,"d":"31.60.3.06"}]
[null,"MG","Santo Antônio do Monte","MG - Santo Antônio do Monte",{"v":3160405,"d":"31.60.4.05"}]
[null,"MG","Santo Antônio do Retiro","MG - Santo Antônio do Retiro",{"v":3160454,"d":"31.60.4.54"}]
[null,"MG","Santo Antônio do Rio Abaixo","MG - Santo Antônio do Rio Abaixo",{"v":3160504,"d":"31.60.5.04"}]
[null,"MG","Santo Hipólito","MG - Santo Hipólito",{"v":3160603,"d":"31.60.6.03"}]
[null,"MG","Santos Dumont","MG - Santos Dumont",{"v":3160702,"d":"31.60.7.02"}]
[null,"MG","São Bento Abade","MG - São Bento Abade",{"v":3160801,"d":"31.60.8.01"}]
[null,"MG","São Brás do Suaçuí","MG - São Brás do Suaçuí",{"v":3160900,"d":"31.60.9.00"}]
[null,"MG","São Domingos das Dores","MG - São Domingos das Dores",{"v":3160959,"d":"31.60.9.59"}]
[null,"MG","São Domingos do Prata","MG - São Domingos do Prata",{"v":3161007,"d":"31.61.0.07"}]
[null,"MG","São Félix de Minas","MG - São Félix de Minas",{"v":3161056,"d":"31.61.0.56"}]
[null,"MG","São Francisco","MG - São Francisco",{"v":3161106,"d":"31.61.1.06"}]
[null,"MG","São Francisco de Paula","MG - São Francisco de Paula",{"v":3161205,"d":"31.61.2.05"}]
[null,"MG","São Francisco de Sales","MG - São Francisco de Sales",{"v":3161304,"d":"31.61.3.04"}]
[null,"MG","São Francisco do Glória","MG - São Francisco do Glória",{"v":3161403,"d":"31.61.4.03"}]
[null,"MG","São Geraldo","MG - São Geraldo",{"v":3161502,"d":"31.61.5.02"}]
[null,"MG","São Geraldo da Piedade","MG - São Geraldo da Piedade",{"v":3161601,"d":"31.61.6.01"}]
[null,"MG","São Geraldo do Baixio","MG - São Geraldo do Baixio",{"v":3161650,"d":"31.61.6.50"}]
[null,"MG","São Gonçalo do Abaeté","MG - São Gonçalo do Abaeté",{"v":3161700,"d":"31.61.7.00"}]
[null,"MG","São Gonçalo do Pará","MG - São Gonçalo do Pará",{"v":3161809,"d":"31.61.8.09"}]
[null,"MG","São Gonçalo do Rio Abaixo","MG - São Gonçalo do Rio Abaixo",{"v":3161908,"d":"31.61.9.08"}]
[null,"MG","São Gonçalo do Rio Preto","MG - São Gonçalo do Rio Preto",{"v":3125507,"d":"31.25.5.07"}]
[null,"MG","São Gonçalo do Sapucaí","MG - São Gonçalo do Sapucaí",{"v":3162005,"d":"31.62.0.05"}]
[null,"MG","São Gotardo","MG - São Gotardo",{"v":3162104,"d":"31.62.1.04"}]
[null,"MG","São João Batista do Glória","MG - São João Batista do Glória",{"v":3162203,"d":"31.62.2.03"}]
[null,"MG","São João da Lagoa","MG - São João da Lagoa",{"v":3162252,"d":"31.62.2.52"}]
[null,"MG","São João da Mata","MG - São João da Mata",{"v":3162302,"d":"31.62.3.02"}]
[null,"MG","São João da Ponte","MG - São João da Ponte",{"v":3162401,"d":"31.62.4.01"}]
[null,"MG","São João das Missões","MG - São João das Missões",{"v":3162450,"d":"31.62.4.50"}]
[null,"MG","São João del Rei","MG - São João del Rei",{"v":3162500,"d":"31.62.5.00"}]
[null,"MG","São João do Manhuaçu","MG - São João do Manhuaçu",{"v":3162559,"d":"31.62.5.59"}]
[null,"MG","São João do Manteninha","MG - São João do Manteninha",{"v":3162575,"d":"31.62.5.75"}]
[null,"MG","São João do Oriente","MG - São João do Oriente",{"v":3162609,"d":"31.62.6.09"}]
[null,"MG","São João do Pacuí","MG - São João do Pacuí",{"v":3162658,"d":"31.62.6.58"}]
[null,"MG","São João do Paraíso","MG - São João do Paraíso",{"v":3162708,"d":"31.62.7.08"}]
[null,"MG","São João Evangelista","MG - São João Evangelista",{"v":3162807,"d":"31.62.8.07"}]
[null,"MG","São João Nepomuceno","MG - São João Nepomuceno",{"v":3162906,"d":"31.62.9.06"}]
[null,"MG","São Joaquim de Bicas","MG - São Joaquim de Bicas",{"v":3162922,"d":"31.62.9.22"}]
[null,"MG","São José da Barra","MG - São José da Barra",{"v":3162948,"d":"31.62.9.48"}]
[null,"MG","São José da Lapa","MG - São José da Lapa",{"v":3162955,"d":"31.62.9.55"}]
[null,"MG","São José da Safira","MG - São José da Safira",{"v":3163003,"d":"31.63.0.03"}]
[null,"MG","São José da Varginha","MG - São José da Varginha",{"v":3163102,"d":"31.63.1.02"}]
[null,"MG","São José do Alegre","MG - São José do Alegre",{"v":3163201,"d":"31.63.2.01"}]
[null,"MG","São José do Divino","MG - São José do Divino",{"v":3163300,"d":"31.63.3.00"}]
[null,"MG","São José do Goiabal","MG - São José do Goiabal",{"v":3163409,"d":"31.63.4.09"}]
[null,"MG","São José do Jacuri","MG - São José do Jacuri",{"v":3163508,"d":"31.63.5.08"}]
[null,"MG","São José do Mantimento","MG - São José do Mantimento",{"v":3163607,"d":"31.63.6.07"}]
[null,"MG","São Lourenço","MG - São Lourenço",{"v":3163706,"d":"31.63.7.06"}]
[null,"MG","São Miguel do Anta","MG - São Miguel do Anta",{"v":3163805,"d":"31.63.8.05"}]
[null,"MG","São Pedro da União","MG - São Pedro da União",{"v":3163904,"d":"31.63.9.04"}]
[null,"MG","São Pedro do Suaçuí","MG - São Pedro do Suaçuí",{"v":3164100,"d":"31.64.1.00"}]
[null,"MG","São Pedro dos Ferros","MG - São Pedro dos Ferros",{"v":3164001,"d":"31.64.0.01"}]
[null,"MG","São Romão","MG - São Romão",{"v":3164209,"d":"31.64.2.09"}]
[null,"MG","São Roque de Minas","MG - São Roque de Minas",{"v":3164308,"d":"31.64.3.08"}]
[null,"MG","São Sebastião da Bela Vista","MG - São Sebastião da Bela Vista",{"v":3164407,"d":"31.64.4.07"}]
[null,"MG","São Sebastião da Vargem Alegre","MG - São Sebastião da Vargem Alegre",{"v":3164431,"d":"31.64.4.31"}]
[null,"MG","São Sebastião do Anta","MG - São Sebastião do Anta",{"v":3164472,"d":"31.64.4.72"}]
[null,"MG","São Sebastião do Maranhão","MG - São Sebastião do Maranhão",{"v":3164506,"d":"31.64.5.06"}]
[null,"MG","São Sebastião do Oeste","MG - São Sebastião do Oeste",{"v":3164605,"d":"31.64.6.05"}]
[null,"MG","São Sebastião do Paraíso","MG - São Sebastião do Paraíso",{"v":3164704,"d":"31.64.7.04"}]
[null,"MG","São Sebastião do Rio Preto","MG - São Sebastião do Rio Preto",{"v":3164803,"d":"31.64.8.03"}]
[null,"MG","São Sebastião do Rio Verde","MG - São Sebastião do Rio Verde",{"v":3164902,"d":"31.64.9.02"}]
[null,"MG","São Thomé das Letras",{"$f":"CONCATENATE(B2143,\" - \",C2143)","v":"MG - São Thomé das Letras"},{"v":3165206,"d":"31.65.2.06"}]
[null,"MG","São Tiago","MG - São Tiago",{"v":3165008,"d":"31.65.0.08"}]
[null,"MG","São Tomás de Aquino","MG - São Tomás de Aquino",{"v":3165107,"d":"31.65.1.07"}]
[null,"MG","São Vicente de Minas","MG - São Vicente de Minas",{"v":3165305,"d":"31.65.3.05"}]
[null,"MG","Sapucaí-Mirim","MG - Sapucaí-Mirim",{"v":3165404,"d":"31.65.4.04"}]
[null,"MG","Sardoá","MG - Sardoá",{"v":3165503,"d":"31.65.5.03"}]
[null,"MG","Sarzedo","MG - Sarzedo",{"v":3165537,"d":"31.65.5.37"}]
[null,"MG","Sem-Peixe","MG - Sem-Peixe",{"v":3165560,"d":"31.65.5.60"}]
[null,"MG","Senador Amaral","MG - Senador Amaral",{"v":3165578,"d":"31.65.5.78"}]
[null,"MG","Senador Cortes","MG - Senador Cortes",{"v":3165602,"d":"31.65.6.02"}]
[null,"MG","Senador Firmino","MG - Senador Firmino",{"v":3165701,"d":"31.65.7.01"}]
[null,"MG","Senador José Bento","MG - Senador José Bento",{"v":3165800,"d":"31.65.8.00"}]
[null,"MG","Senador Modestino Gonçalves","MG - Senador Modestino Gonçalves",{"v":3165909,"d":"31.65.9.09"}]
[null,"MG","Senhora de Oliveira","MG - Senhora de Oliveira",{"v":3166006,"d":"31.66.0.06"}]
[null,"MG","Senhora do Porto","MG - Senhora do Porto",{"v":3166105,"d":"31.66.1.05"}]
[null,"MG","Senhora dos Remédios","MG - Senhora dos Remédios",{"v":3166204,"d":"31.66.2.04"}]
[null,"MG","Sericita","MG - Sericita",{"v":3166303,"d":"31.66.3.03"}]
[null,"MG","Seritinga","MG - Seritinga",{"v":3166402,"d":"31.66.4.02"}]
[null,"MG","Serra Azul de Minas","MG - Serra Azul de Minas",{"v":3166501,"d":"31.66.5.01"}]
[null,"MG","Serra da Saudade","MG - Serra da Saudade",{"v":3166600,"d":"31.66.6.00"}]
[null,"MG","Serra do Salitre","MG - Serra do Salitre",{"v":3166808,"d":"31.66.8.08"}]
[null,"MG","Serra dos Aimorés","MG - Serra dos Aimorés",{"v":3166709,"d":"31.66.7.09"}]
[null,"MG","Serrania","MG - Serrania",{"v":3166907,"d":"31.66.9.07"}]
[null,"MG","Serranópolis de Minas","MG - Serranópolis de Minas",{"v":3166956,"d":"31.66.9.56"}]
[null,"MG","Serranos","MG - Serranos",{"v":3167004,"d":"31.67.0.04"}]
[null,"MG","Serro","MG - Serro",{"v":3167103,"d":"31.67.1.03"}]
[null,"MG","Sete Lagoas","MG - Sete Lagoas",{"v":3167202,"d":"31.67.2.02"}]
[null,"MG","Setubinha","MG - Setubinha",{"v":3165552,"d":"31.65.5.52"}]
[null,"MG","Silveirânia","MG - Silveirânia",{"v":3167301,"d":"31.67.3.01"}]
[null,"MG","Silvianópolis","MG - Silvianópolis",{"v":3167400,"d":"31.67.4.00"}]
[null,"MG","Simão Pereira","MG - Simão Pereira",{"v":3167509,"d":"31.67.5.09"}]
[null,"MG","Simonésia","MG - Simonésia",{"v":3167608,"d":"31.67.6.08"}]
[null,"MG","Sobrália","MG - Sobrália",{"v":3167707,"d":"31.67.7.07"}]
[null,"MG","Soledade de Minas","MG - Soledade de Minas",{"v":3167806,"d":"31.67.8.06"}]
[null,"MG","Tabuleiro","MG - Tabuleiro",{"v":3167905,"d":"31.67.9.05"}]
[null,"MG","Taiobeiras","MG - Taiobeiras",{"v":3168002,"d":"31.68.0.02"}]
[null,"MG","Taparuba","MG - Taparuba",{"v":3168051,"d":"31.68.0.51"}]
[null,"MG","Tapira","MG - Tapira",{"v":3168101,"d":"31.68.1.01"}]
[null,"MG","Tapiraí","MG - Tapiraí",{"v":3168200,"d":"31.68.2.00"}]
[null,"MG","Taquaraçu de Minas","MG - Taquaraçu de Minas",{"v":3168309,"d":"31.68.3.09"}]
[null,"MG","Tarumirim","MG - Tarumirim",{"v":3168408,"d":"31.68.4.08"}]
[null,"MG","Teixeiras","MG - Teixeiras",{"v":3168507,"d":"31.68.5.07"}]
[null,"MG","Teófilo Otoni","MG - Teófilo Otoni",{"v":3168606,"d":"31.68.6.06"}]
[null,"MG","Timóteo","MG - Timóteo",{"v":3168705,"d":"31.68.7.05"}]
[null,"MG","Tiradentes","MG - Tiradentes",{"v":3168804,"d":"31.68.8.04"}]
[null,"MG","Tiros","MG - Tiros",{"v":3168903,"d":"31.68.9.03"}]
[null,"MG","Tocantins","MG - Tocantins",{"v":3169000,"d":"31.69.0.00"}]
[null,"MG","Tocos do Moji","MG - Tocos do Moji",{"v":3169059,"d":"31.69.0.59"}]
[null,"MG","Toledo","MG - Toledo",{"v":3169109,"d":"31.69.1.09"}]
[null,"MG","Tombos","MG - Tombos",{"v":3169208,"d":"31.69.2.08"}]
[null,"MG","Três Corações","MG - Três Corações",{"v":3169307,"d":"31.69.3.07"}]
[null,"MG","Três Marias","MG - Três Marias",{"v":3169356,"d":"31.69.3.56"}]
[null,"MG","Três Pontas","MG - Três Pontas",{"v":3169406,"d":"31.69.4.06"}]
[null,"MG","Tumiritinga","MG - Tumiritinga",{"v":3169505,"d":"31.69.5.05"}]
[null,"MG","Tupaciguara","MG - Tupaciguara",{"v":3169604,"d":"31.69.6.04"}]
[null,"MG","Turmalina","MG - Turmalina",{"v":3169703,"d":"31.69.7.03"}]
[null,"MG","Turvolândia","MG - Turvolândia",{"v":3169802,"d":"31.69.8.02"}]
[null,"MG","Ubá","MG - Ubá",{"v":3169901,"d":"31.69.9.01"}]
[null,"MG","Ubaí","MG - Ubaí",{"v":3170008,"d":"31.70.0.08"}]
[null,"MG","Ubaporanga","MG - Ubaporanga",{"v":3170057,"d":"31.70.0.57"}]
[null,"MG","Uberaba","MG - Uberaba",{"v":3170107,"d":"31.70.1.07"}]
[null,"MG","Uberlândia","MG - Uberlândia",{"v":3170206,"d":"31.70.2.06"}]
[null,"MG","Umburatiba","MG - Umburatiba",{"v":3170305,"d":"31.70.3.05"}]
[null,"MG","Unaí","MG - Unaí",{"v":3170404,"d":"31.70.4.04"}]
[null,"MG","União de Minas",{"$f":"CONCATENATE(B2207,\" - \",C2207)","v":"MG - União de Minas"},{"v":3170438,"d":"31.70.4.38"}]
[null,"MG","Uruana de Minas","MG - Uruana de Minas",{"v":3170479,"d":"31.70.4.79"}]
[null,"MG","Urucânia","MG - Urucânia",{"v":3170503,"d":"31.70.5.03"}]
[null,"MG","Urucuia","MG - Urucuia",{"v":3170529,"d":"31.70.5.29"}]
[null,"MG","Vargem Alegre","MG - Vargem Alegre",{"v":3170578,"d":"31.70.5.78"}]
[null,"MG","Vargem Bonita","MG - Vargem Bonita",{"v":3170602,"d":"31.70.6.02"}]
[null,"MG","Vargem Grande do Rio Pardo","MG - Vargem Grande do Rio Pardo",{"v":3170651,"d":"31.70.6.51"}]
[null,"MG","Varginha","MG - Varginha",{"v":3170701,"d":"31.70.7.01"}]
[null,"MG","Varjão de Minas","MG - Varjão de Minas",{"v":3170750,"d":"31.70.7.50"}]
[null,"MG","Várzea da Palma","MG - Várzea da Palma",{"v":3170800,"d":"31.70.8.00"}]
[null,"MG","Varzelândia","MG - Varzelândia",{"v":3170909,"d":"31.70.9.09"}]
[null,"MG","Vazante","MG - Vazante",{"v":3171006,"d":"31.71.0.06"}]
[null,"MG","Verdelândia","MG - Verdelândia",{"v":3171030,"d":"31.71.0.30"}]
[null,"MG","Veredinha","MG - Veredinha",{"v":3171071,"d":"31.71.0.71"}]
[null,"MG","Veríssimo","MG - Veríssimo",{"v":3171105,"d":"31.71.1.05"}]
[null,"MG","Vermelho Novo","MG - Vermelho Novo",{"v":3171154,"d":"31.71.1.54"}]
[null,"MG","Vespasiano","MG - Vespasiano",{"v":3171204,"d":"31.71.2.04"}]
[null,"MG","Viçosa","MG - Viçosa",{"v":3171303,"d":"31.71.3.03"}]
[null,"MG","Vieiras","MG - Vieiras",{"v":3171402,"d":"31.71.4.02"}]
[null,"MG","Virgem da Lapa","MG - Virgem da Lapa",{"v":3171600,"d":"31.71.6.00"}]
[null,"MG","Virgínia","MG - Virgínia",{"v":3171709,"d":"31.71.7.09"}]
[null,"MG","Virginópolis","MG - Virginópolis",{"v":3171808,"d":"31.71.8.08"}]
[null,"MG","Virgolândia","MG - Virgolândia",{"v":3171907,"d":"31.71.9.07"}]
[null,"MG","Visconde do Rio Branco","MG - Visconde do Rio Branco",{"v":3172004,"d":"31.72.0.04"}]
[null,"MG","Volta Grande","MG - Volta Grande",{"v":3172103,"d":"31.72.1.03"}]
[null,"MG","Wenceslau Braz","MG - Wenceslau Braz",{"v":3172202,"d":"31.72.2.02"}]
[null,"MS","Água Clara","MS - Água Clara",{"v":5000203,"d":"50.00.2.03"}]
[null,"MS","Alcinópolis","MS - Alcinópolis",{"v":5000252,"d":"50.00.2.52"}]
[null,"MS","Amambai","MS - Amambai",{"v":5000609,"d":"50.00.6.09"}]
[null,"MS","Anastácio","MS - Anastácio",{"v":5000708,"d":"50.00.7.08"}]
[null,"MS","Anaurilândia","MS - Anaurilândia",{"v":5000807,"d":"50.00.8.07"}]
[null,"MS","Angélica","MS - Angélica",{"v":5000856,"d":"50.00.8.56"}]
[null,"MS","Antônio João","MS - Antônio João",{"v":5000906,"d":"50.00.9.06"}]
[null,"MS","Aparecida do Taboado","MS - Aparecida do Taboado",{"v":5001003,"d":"50.01.0.03"}]
[null,"MS","Aquidauana","MS - Aquidauana",{"v":5001102,"d":"50.01.1.02"}]
[null,"MS","Aral Moreira","MS - Aral Moreira",{"v":5001243,"d":"50.01.2.43"}]
[null,"MS","Bandeirantes","MS - Bandeirantes",{"v":5001508,"d":"50.01.5.08"}]
[null,"MS","Bataguassu","MS - Bataguassu",{"v":5001904,"d":"50.01.9.04"}]
[null,"MS","Batayporã","MS - Batayporã",{"v":5002001,"d":"50.02.0.01"}]
[null,"MS","Bela Vista","MS - Bela Vista",{"v":5002100,"d":"50.02.1.00"}]
[null,"MS","Bodoquena","MS - Bodoquena",{"v":5002159,"d":"50.02.1.59"}]
[null,"MS","Bonito","MS - Bonito",{"v":5002209,"d":"50.02.2.09"}]
[null,"MS","Brasilândia","MS - Brasilândia",{"v":5002308,"d":"50.02.3.08"}]
[null,"MS","Caarapó","MS - Caarapó",{"v":5002407,"d":"50.02.4.07"}]
[null,"MS","Camapuã","MS - Camapuã",{"v":5002605,"d":"50.02.6.05"}]
[null,"MS","Campo Grande","MS - Campo Grande",{"v":5002704,"d":"50.02.7.04"}]
[null,"MS","Caracol","MS - Caracol",{"v":5002803,"d":"50.02.8.03"}]
[null,"MS","Cassilândia","MS - Cassilândia",{"v":5002902,"d":"50.02.9.02"}]
[null,"MS","Chapadão do Sul","MS - Chapadão do Sul",{"v":5002951,"d":"50.02.9.51"}]
[null,"MS","Corguinho","MS - Corguinho",{"v":5003108,"d":"50.03.1.08"}]
[null,"MS","Coronel Sapucaia","MS - Coronel Sapucaia",{"v":5003157,"d":"50.03.1.57"}]
[null,"MS","Corumbá","MS - Corumbá",{"v":5003207,"d":"50.03.2.07"}]
[null,"MS","Costa Rica","MS - Costa Rica",{"v":5003256,"d":"50.03.2.56"}]
[null,"MS","Coxim","MS - Coxim",{"v":5003306,"d":"50.03.3.06"}]
[null,"MS","Deodápolis","MS - Deodápolis",{"v":5003454,"d":"50.03.4.54"}]
[null,"MS","Dois Irmãos do Buriti","MS - Dois Irmãos do Buriti",{"v":5003488,"d":"50.03.4.88"}]
[null,"MS","Douradina","MS - Douradina",{"v":5003504,"d":"50.03.5.04"}]
[null,"MS","Dourados","MS - Dourados",{"v":5003702,"d":"50.03.7.02"}]
[null,"MS","Eldorado","MS - Eldorado",{"v":5003751,"d":"50.03.7.51"}]
[null,"MS","Fátima do Sul","MS - Fátima do Sul",{"v":5003801,"d":"50.03.8.01"}]
[null,"MS","Figueirão","MS - Figueirão",{"v":5003900,"d":"50.03.9.00"}]
[null,"MS","Glória de Dourados","MS - Glória de Dourados",{"v":5004007,"d":"50.04.0.07"}]
[null,"MS","Guia Lopes da Laguna","MS - Guia Lopes da Laguna",{"v":5004106,"d":"50.04.1.06"}]
[null,"MS","Iguatemi","MS - Iguatemi",{"v":5004304,"d":"50.04.3.04"}]
[null,"MS","Inocência",{"$f":"CONCATENATE(B2271,\" - \",C2271)","v":"MS - Inocência"},{"v":5004403,"d":"50.04.4.03"}]
[null,"MS","Itaporã","MS - Itaporã",{"v":5004502,"d":"50.04.5.02"}]
[null,"MS","Itaquiraí","MS - Itaquiraí",{"v":5004601,"d":"50.04.6.01"}]
[null,"MS","Ivinhema","MS - Ivinhema",{"v":5004700,"d":"50.04.7.00"}]
[null,"MS","Japorã","MS - Japorã",{"v":5004809,"d":"50.04.8.09"}]
[null,"MS","Jaraguari","MS - Jaraguari",{"v":5004908,"d":"50.04.9.08"}]
[null,"MS","Jardim","MS - Jardim",{"v":5005004,"d":"50.05.0.04"}]
[null,"MS","Jateí","MS - Jateí",{"v":5005103,"d":"50.05.1.03"}]
[null,"MS","Juti","MS - Juti",{"v":5005152,"d":"50.05.1.52"}]
[null,"MS","Ladário","MS - Ladário",{"v":5005202,"d":"50.05.2.02"}]
[null,"MS","Laguna Carapã","MS - Laguna Carapã",{"v":5005251,"d":"50.05.2.51"}]
[null,"MS","Maracaju","MS - Maracaju",{"v":5005400,"d":"50.05.4.00"}]
[null,"MS","Miranda","MS - Miranda",{"v":5005608,"d":"50.05.6.08"}]
[null,"MS","Mundo Novo","MS - Mundo Novo",{"v":5005681,"d":"50.05.6.81"}]
[null,"MS","Naviraí","MS - Naviraí",{"v":5005707,"d":"50.05.7.07"}]
[null,"MS","Nioaque","MS - Nioaque",{"v":5005806,"d":"50.05.8.06"}]
[null,"MS","Nova Alvorada do Sul","MS - Nova Alvorada do Sul",{"v":5006002,"d":"50.06.0.02"}]
[null,"MS","Nova Andradina","MS - Nova Andradina",{"v":5006200,"d":"50.06.2.00"}]
[null,"MS","Novo Horizonte do Sul","MS - Novo Horizonte do Sul",{"v":5006259,"d":"50.06.2.59"}]
[null,"MS","Paranaíba","MS - Paranaíba",{"v":5006309,"d":"50.06.3.09"}]
[null,"MS","Paranhos","MS - Paranhos",{"v":5006358,"d":"50.06.3.58"}]
[null,"MS","Pedro Gomes","MS - Pedro Gomes",{"v":5006408,"d":"50.06.4.08"}]
[null,"MS","Ponta Porã","MS - Ponta Porã",{"v":5006606,"d":"50.06.6.06"}]
[null,"MS","Porto Murtinho","MS - Porto Murtinho",{"v":5006903,"d":"50.06.9.03"}]
[null,"MS","Ribas do Rio Pardo","MS - Ribas do Rio Pardo",{"v":5007109,"d":"50.07.1.09"}]
[null,"MS","Rio Brilhante","MS - Rio Brilhante",{"v":5007208,"d":"50.07.2.08"}]
[null,"MS","Rio Negro","MS - Rio Negro",{"v":5007307,"d":"50.07.3.07"}]
[null,"MS","Rio Verde de Mato Grosso","MS - Rio Verde de Mato Grosso",{"v":5007406,"d":"50.07.4.06"}]
[null,"MS","Rochedo","MS - Rochedo",{"v":5007505,"d":"50.07.5.05"}]
[null,"MS","Santa Rita do Pardo","MS - Santa Rita do Pardo",{"v":5007554,"d":"50.07.5.54"}]
[null,"MS","São Gabriel do Oeste","MS - São Gabriel do Oeste",{"v":5007695,"d":"50.07.6.95"}]
[null,"MS","Selvíria","MS - Selvíria",{"v":5007802,"d":"50.07.8.02"}]
[null,"MS","Sete Quedas","MS - Sete Quedas",{"v":5007703,"d":"50.07.7.03"}]
[null,"MS","Sidrolândia","MS - Sidrolândia",{"v":5007901,"d":"50.07.9.01"}]
[null,"MS","Sonora","MS - Sonora",{"v":5007935,"d":"50.07.9.35"}]
[null,"MS","Tacuru","MS - Tacuru",{"v":5007950,"d":"50.07.9.50"}]
[null,"MS","Taquarussu","MS - Taquarussu",{"v":5007976,"d":"50.07.9.76"}]
[null,"MS","Terenos","MS - Terenos",{"v":5008008,"d":"50.08.0.08"}]
[null,"MS","Três Lagoas","MS - Três Lagoas",{"v":5008305,"d":"50.08.3.05"}]
[null,"MS","Vicentina","MS - Vicentina",{"v":5008404,"d":"50.08.4.04"}]
[null,"MT","Acorizal","MT - Acorizal",{"v":5100102,"d":"51.00.1.02"}]
[null,"MT","Água Boa","MT - Água Boa",{"v":5100201,"d":"51.00.2.01"}]
[null,"MT","Alta Floresta","MT - Alta Floresta",{"v":5100250,"d":"51.00.2.50"}]
[null,"MT","Alto Araguaia","MT - Alto Araguaia",{"v":5100300,"d":"51.00.3.00"}]
[null,"MT","Alto Boa Vista","MT - Alto Boa Vista",{"v":5100359,"d":"51.00.3.59"}]
[null,"MT","Alto Garças","MT - Alto Garças",{"v":5100409,"d":"51.00.4.09"}]
[null,"MT","Alto Paraguai","MT - Alto Paraguai",{"v":5100508,"d":"51.00.5.08"}]
[null,"MT","Alto Taquari","MT - Alto Taquari",{"v":5100607,"d":"51.00.6.07"}]
[null,"MT","Apiacás","MT - Apiacás",{"v":5100805,"d":"51.00.8.05"}]
[null,"MT","Araguaiana","MT - Araguaiana",{"v":5101001,"d":"51.01.0.01"}]
[null,"MT","Araguainha","MT - Araguainha",{"v":5101209,"d":"51.01.2.09"}]
[null,"MT","Araputanga","MT - Araputanga",{"v":5101258,"d":"51.01.2.58"}]
[null,"MT","Arenápolis","MT - Arenápolis",{"v":5101308,"d":"51.01.3.08"}]
[null,"MT","Aripuanã","MT - Aripuanã",{"v":5101407,"d":"51.01.4.07"}]
[null,"MT","Barão de Melgaço","MT - Barão de Melgaço",{"v":5101605,"d":"51.01.6.05"}]
[null,"MT","Barra do Bugres","MT - Barra do Bugres",{"v":5101704,"d":"51.01.7.04"}]
[null,"MT","Barra do Garças","MT - Barra do Garças",{"v":5101803,"d":"51.01.8.03"}]
[null,"MT","Bom Jesus do Araguaia","MT - Bom Jesus do Araguaia",{"v":5101852,"d":"51.01.8.52"}]
[null,"MT","Brasnorte","MT - Brasnorte",{"v":5101902,"d":"51.01.9.02"}]
[null,"MT","Cáceres","MT - Cáceres",{"v":5102504,"d":"51.02.5.04"}]
[null,"MT","Campinápolis","MT - Campinápolis",{"v":5102603,"d":"51.02.6.03"}]
[null,"MT","Campo Novo do Parecis","MT - Campo Novo do Parecis",{"v":5102637,"d":"51.02.6.37"}]
[null,"MT","Campo Verde","MT - Campo Verde",{"v":5102678,"d":"51.02.6.78"}]
[null,"MT","Campos de Júlio","MT - Campos de Júlio",{"v":5102686,"d":"51.02.6.86"}]
[null,"MT","Canabrava do Norte",{"$f":"CONCATENATE(B2335,\" - \",C2335)","v":"MT - Canabrava do Norte"},{"v":5102694,"d":"51.02.6.94"}]
[null,"MT","Canarana","MT - Canarana",{"v":5102702,"d":"51.02.7.02"}]
[null,"MT","Carlinda","MT - Carlinda",{"v":5102793,"d":"51.02.7.93"}]
[null,"MT","Castanheira","MT - Castanheira",{"v":5102850,"d":"51.02.8.50"}]
[null,"MT","Chapada dos Guimarães","MT - Chapada dos Guimarães",{"v":5103007,"d":"51.03.0.07"}]
[null,"MT","Cláudia","MT - Cláudia",{"v":5103056,"d":"51.03.0.56"}]
[null,"MT","Cocalinho","MT - Cocalinho",{"v":5103106,"d":"51.03.1.06"}]
[null,"MT","Colíder","MT - Colíder",{"v":5103205,"d":"51.03.2.05"}]
[null,"MT","Colniza","MT - Colniza",{"v":5103254,"d":"51.03.2.54"}]
[null,"MT","Comodoro","MT - Comodoro",{"v":5103304,"d":"51.03.3.04"}]
[null,"MT","Confresa","MT - Confresa",{"v":5103353,"d":"51.03.3.53"}]
[null,"MT","Conquista D'Oeste","MT - Conquista D'Oeste",{"v":5103361,"d":"51.03.3.61"}]
[null,"MT","Cotriguaçu","MT - Cotriguaçu",{"v":5103379,"d":"51.03.3.79"}]
[null,"MT","Cuiabá","MT - Cuiabá",{"v":5103403,"d":"51.03.4.03"}]
[null,"MT","Curvelândia","MT - Curvelândia",{"v":5103437,"d":"51.03.4.37"}]
[null,"MT","Denise","MT - Denise",{"v":5103452,"d":"51.03.4.52"}]
[null,"MT","Diamantino","MT - Diamantino",{"v":5103502,"d":"51.03.5.02"}]
[null,"MT","Dom Aquino","MT - Dom Aquino",{"v":5103601,"d":"51.03.6.01"}]
[null,"MT","Feliz Natal","MT - Feliz Natal",{"v":5103700,"d":"51.03.7.00"}]
[null,"MT","Figueirópolis D'Oeste","MT - Figueirópolis D'Oeste",{"v":5103809,"d":"51.03.8.09"}]
[null,"MT","Gaúcha do Norte","MT - Gaúcha do Norte",{"v":5103858,"d":"51.03.8.58"}]
[null,"MT","General Carneiro","MT - General Carneiro",{"v":5103908,"d":"51.03.9.08"}]
[null,"MT","Glória D'Oeste","MT - Glória D'Oeste",{"v":5103957,"d":"51.03.9.57"}]
[null,"MT","Guarantã do Norte","MT - Guarantã do Norte",{"v":5104104,"d":"51.04.1.04"}]
[null,"MT","Guiratinga","MT - Guiratinga",{"v":5104203,"d":"51.04.2.03"}]
[null,"MT","Indiavaí","MT - Indiavaí",{"v":5104500,"d":"51.04.5.00"}]
[null,"MT","Ipiranga do Norte","MT - Ipiranga do Norte",{"v":5104526,"d":"51.04.5.26"}]
[null,"MT","Itanhangá","MT - Itanhangá",{"v":5104542,"d":"51.04.5.42"}]
[null,"MT","Itaúba","MT - Itaúba",{"v":5104559,"d":"51.04.5.59"}]
[null,"MT","Itiquira","MT - Itiquira",{"v":5104609,"d":"51.04.6.09"}]
[null,"MT","Jaciara","MT - Jaciara",{"v":5104807,"d":"51.04.8.07"}]
[null,"MT","Jangada","MT - Jangada",{"v":5104906,"d":"51.04.9.06"}]
[null,"MT","Jauru","MT - Jauru",{"v":5105002,"d":"51.05.0.02"}]
[null,"MT","Juara","MT - Juara",{"v":5105101,"d":"51.05.1.01"}]
[null,"MT","Juína","MT - Juína",{"v":5105150,"d":"51.05.1.50"}]
[null,"MT","Juruena","MT - Juruena",{"v":5105176,"d":"51.05.1.76"}]
[null,"MT","Juscimeira","MT - Juscimeira",{"v":5105200,"d":"51.05.2.00"}]
[null,"MT","Lambari D'Oeste","MT - Lambari D'Oeste",{"v":5105234,"d":"51.05.2.34"}]
[null,"MT","Lucas do Rio Verde","MT - Lucas do Rio Verde",{"v":5105259,"d":"51.05.2.59"}]
[null,"MT","Luciara","MT - Luciara",{"v":5105309,"d":"51.05.3.09"}]
[null,"MT","Marcelândia","MT - Marcelândia",{"v":5105580,"d":"51.05.5.80"}]
[null,"MT","Matupá","MT - Matupá",{"v":5105606,"d":"51.05.6.06"}]
[null,"MT","Mirassol d'Oeste","MT - Mirassol d'Oeste",{"v":5105622,"d":"51.05.6.22"}]
[null,"MT","Nobres","MT - Nobres",{"v":5105903,"d":"51.05.9.03"}]
[null,"MT","Nortelândia","MT - Nortelândia",{"v":5106000,"d":"51.06.0.00"}]
[null,"MT","Nossa Senhora do Livramento","MT - Nossa Senhora do Livramento",{"v":5106109,"d":"51.06.1.09"}]
[null,"MT","Nova Bandeirantes","MT - Nova Bandeirantes",{"v":5106158,"d":"51.06.1.58"}]
[null,"MT","Nova Brasilândia","MT - Nova Brasilândia",{"v":5106208,"d":"51.06.2.08"}]
[null,"MT","Nova Canaã do Norte","MT - Nova Canaã do Norte",{"v":5106216,"d":"51.06.2.16"}]
[null,"MT","Nova Guarita","MT - Nova Guarita",{"v":5108808,"d":"51.08.8.08"}]
[null,"MT","Nova Lacerda","MT - Nova Lacerda",{"v":5106182,"d":"51.06.1.82"}]
[null,"MT","Nova Marilândia","MT - Nova Marilândia",{"v":5108857,"d":"51.08.8.57"}]
[null,"MT","Nova Maringá","MT - Nova Maringá",{"v":5108907,"d":"51.08.9.07"}]
[null,"MT","Nova Monte Verde","MT - Nova Monte Verde",{"v":5108956,"d":"51.08.9.56"}]
[null,"MT","Nova Mutum","MT - Nova Mutum",{"v":5106224,"d":"51.06.2.24"}]
[null,"MT","Nova Nazaré","MT - Nova Nazaré",{"v":5106174,"d":"51.06.1.74"}]
[null,"MT","Nova Olímpia","MT - Nova Olímpia",{"v":5106232,"d":"51.06.2.32"}]
[null,"MT","Nova Santa Helena","MT - Nova Santa Helena",{"v":5106190,"d":"51.06.1.90"}]
[null,"MT","Nova Ubiratã","MT - Nova Ubiratã",{"v":5106240,"d":"51.06.2.40"}]
[null,"MT","Nova Xavantina","MT - Nova Xavantina",{"v":5106257,"d":"51.06.2.57"}]
[null,"MT","Novo Horizonte do Norte","MT - Novo Horizonte do Norte",{"v":5106273,"d":"51.06.2.73"}]
[null,"MT","Novo Mundo","MT - Novo Mundo",{"v":5106265,"d":"51.06.2.65"}]
[null,"MT","Novo Santo Antônio","MT - Novo Santo Antônio",{"v":5106315,"d":"51.06.3.15"}]
[null,"MT","Novo São Joaquim","MT - Novo São Joaquim",{"v":5106281,"d":"51.06.2.81"}]
[null,"MT","Paranaíta",{"$f":"CONCATENATE(B2399,\" - \",C2399)","v":"MT - Paranaíta"},{"v":5106299,"d":"51.06.2.99"}]
[null,"MT","Paranatinga","MT - Paranatinga",{"v":5106307,"d":"51.06.3.07"}]
[null,"MT","Pedra Preta","MT - Pedra Preta",{"v":5106372,"d":"51.06.3.72"}]
[null,"MT","Peixoto de Azevedo","MT - Peixoto de Azevedo",{"v":5106422,"d":"51.06.4.22"}]
[null,"MT","Planalto da Serra","MT - Planalto da Serra",{"v":5106455,"d":"51.06.4.55"}]
[null,"MT","Poconé","MT - Poconé",{"v":5106505,"d":"51.06.5.05"}]
[null,"MT","Pontal do Araguaia","MT - Pontal do Araguaia",{"v":5106653,"d":"51.06.6.53"}]
[null,"MT","Ponte Branca","MT - Ponte Branca",{"v":5106703,"d":"51.06.7.03"}]
[null,"MT","Pontes e Lacerda","MT - Pontes e Lacerda",{"v":5106752,"d":"51.06.7.52"}]
[null,"MT","Porto Alegre do Norte","MT - Porto Alegre do Norte",{"v":5106778,"d":"51.06.7.78"}]
[null,"MT","Porto dos Gaúchos","MT - Porto dos Gaúchos",{"v":5106802,"d":"51.06.8.02"}]
[null,"MT","Porto Esperidião","MT - Porto Esperidião",{"v":5106828,"d":"51.06.8.28"}]
[null,"MT","Porto Estrela","MT - Porto Estrela",{"v":5106851,"d":"51.06.8.51"}]
[null,"MT","Poxoréo","MT - Poxoréo",{"v":5107008,"d":"51.07.0.08"}]
[null,"MT","Primavera do Leste","MT - Primavera do Leste",{"v":5107040,"d":"51.07.0.40"}]
[null,"MT","Querência","MT - Querência",{"v":5107065,"d":"51.07.0.65"}]
[null,"MT","Reserva do Cabaçal","MT - Reserva do Cabaçal",{"v":5107156,"d":"51.07.1.56"}]
[null,"MT","Ribeirão Cascalheira","MT - Ribeirão Cascalheira",{"v":5107180,"d":"51.07.1.80"}]
[null,"MT","Ribeirãozinho","MT - Ribeirãozinho",{"v":5107198,"d":"51.07.1.98"}]
[null,"MT","Rio Branco","MT - Rio Branco",{"v":5107206,"d":"51.07.2.06"}]
[null,"MT","Rondolândia","MT - Rondolândia",{"v":5107578,"d":"51.07.5.78"}]
[null,"MT","Rondonópolis","MT - Rondonópolis",{"v":5107602,"d":"51.07.6.02"}]
[null,"MT","Rosário Oeste","MT - Rosário Oeste",{"v":5107701,"d":"51.07.7.01"}]
[null,"MT","Salto do Céu","MT - Salto do Céu",{"v":5107750,"d":"51.07.7.50"}]
[null,"MT","Santa Carmem","MT - Santa Carmem",{"v":5107248,"d":"51.07.2.48"}]
[null,"MT","Santa Cruz do Xingu","MT - Santa Cruz do Xingu",{"v":5107743,"d":"51.07.7.43"}]
[null,"MT","Santa Rita do Trivelato","MT - Santa Rita do Trivelato",{"v":5107768,"d":"51.07.7.68"}]
[null,"MT","Santa Terezinha","MT - Santa Terezinha",{"v":5107776,"d":"51.07.7.76"}]
[null,"MT","Santo Afonso","MT - Santo Afonso",{"v":5107263,"d":"51.07.2.63"}]
[null,"MT","Santo Antônio do Leste","MT - Santo Antônio do Leste",{"v":5107792,"d":"51.07.7.92"}]
[null,"MT","Santo Antônio do Leverger","MT - Santo Antônio do Leverger",{"v":5107800,"d":"51.07.8.00"}]
[null,"MT","São Félix do Araguaia","MT - São Félix do Araguaia",{"v":5107859,"d":"51.07.8.59"}]
[null,"MT","São José do Povo","MT - São José do Povo",{"v":5107297,"d":"51.07.2.97"}]
[null,"MT","São José do Rio Claro","MT - São José do Rio Claro",{"v":5107305,"d":"51.07.3.05"}]
[null,"MT","São José do Xingu","MT - São José do Xingu",{"v":5107354,"d":"51.07.3.54"}]
[null,"MT","São José dos Quatro Marcos","MT - São José dos Quatro Marcos",{"v":5107107,"d":"51.07.1.07"}]
[null,"MT","São Pedro da Cipa","MT - São Pedro da Cipa",{"v":5107404,"d":"51.07.4.04"}]
[null,"MT","Sapezal","MT - Sapezal",{"v":5107875,"d":"51.07.8.75"}]
[null,"MT","Serra Nova Dourada","MT - Serra Nova Dourada",{"v":5107883,"d":"51.07.8.83"}]
[null,"MT","Sinop","MT - Sinop",{"v":5107909,"d":"51.07.9.09"}]
[null,"MT","Sorriso","MT - Sorriso",{"v":5107925,"d":"51.07.9.25"}]
[null,"MT","Tabaporã","MT - Tabaporã",{"v":5107941,"d":"51.07.9.41"}]
[null,"MT","Tangará da Serra","MT - Tangará da Serra",{"v":5107958,"d":"51.07.9.58"}]
[null,"MT","Tapurah","MT - Tapurah",{"v":5108006,"d":"51.08.0.06"}]
[null,"MT","Terra Nova do Norte","MT - Terra Nova do Norte",{"v":5108055,"d":"51.08.0.55"}]
[null,"MT","Tesouro","MT - Tesouro",{"v":5108105,"d":"51.08.1.05"}]
[null,"MT","Torixoréu","MT - Torixoréu",{"v":5108204,"d":"51.08.2.04"}]
[null,"MT","União do Sul","MT - União do Sul",{"v":5108303,"d":"51.08.3.03"}]
[null,"MT","Vale de São Domingos","MT - Vale de São Domingos",{"v":5108352,"d":"51.08.3.52"}]
[null,"MT","Várzea Grande","MT - Várzea Grande",{"v":5108402,"d":"51.08.4.02"}]
[null,"MT","Vera","MT - Vera",{"v":5108501,"d":"51.08.5.01"}]
[null,"MT","Vila Bela da Santíssima Trindade","MT - Vila Bela da Santíssima Trindade",{"v":5105507,"d":"51.05.5.07"}]
[null,"MT","Vila Rica","MT - Vila Rica",{"v":5108600,"d":"51.08.6.00"}]
[null,"PA","Abaetetuba","PA - Abaetetuba",{"v":1500107,"d":"15.00.1.07"}]
[null,"PA","Abel Figueiredo","PA - Abel Figueiredo",{"v":1500131,"d":"15.00.1.31"}]
[null,"PA","Acará","PA - Acará",{"v":1500206,"d":"15.00.2.06"}]
[null,"PA","Afuá","PA - Afuá",{"v":1500305,"d":"15.00.3.05"}]
[null,"PA","Água Azul do Norte","PA - Água Azul do Norte",{"v":1500347,"d":"15.00.3.47"}]
[null,"PA","Alenquer","PA - Alenquer",{"v":1500404,"d":"15.00.4.04"}]
[null,"PA","Almeirim","PA - Almeirim",{"v":1500503,"d":"15.00.5.03"}]
[null,"PA","Altamira","PA - Altamira",{"v":1500602,"d":"15.00.6.02"}]
[null,"PA","Anajás","PA - Anajás",{"v":1500701,"d":"15.00.7.01"}]
[null,"PA","Ananindeua","PA - Ananindeua",{"v":1500800,"d":"15.00.8.00"}]
[null,"PA","Anapu","PA - Anapu",{"v":1500859,"d":"15.00.8.59"}]
[null,"PA","Augusto Corrêa",{"$f":"CONCATENATE(B2463,\" - \",C2463)","v":"PA - Augusto Corrêa"},{"v":1500909,"d":"15.00.9.09"}]
[null,"PA","Aurora do Pará","PA - Aurora do Pará",{"v":1500958,"d":"15.00.9.58"}]
[null,"PA","Aveiro","PA - Aveiro",{"v":1501006,"d":"15.01.0.06"}]
[null,"PA","Bagre","PA - Bagre",{"v":1501105,"d":"15.01.1.05"}]
[null,"PA","Baião","PA - Baião",{"v":1501204,"d":"15.01.2.04"}]
[null,"PA","Bannach","PA - Bannach",{"v":1501253,"d":"15.01.2.53"}]
[null,"PA","Barcarena","PA - Barcarena",{"v":1501303,"d":"15.01.3.03"}]
[null,"PA","Belém","PA - Belém",{"v":1501402,"d":"15.01.4.02"}]
[null,"PA","Belterra","PA - Belterra",{"v":1501451,"d":"15.01.4.51"}]
[null,"PA","Benevides","PA - Benevides",{"v":1501501,"d":"15.01.5.01"}]
[null,"PA","Bom Jesus do Tocantins","PA - Bom Jesus do Tocantins",{"v":1501576,"d":"15.01.5.76"}]
[null,"PA","Bonito","PA - Bonito",{"v":1501600,"d":"15.01.6.00"}]
[null,"PA","Bragança","PA - Bragança",{"v":1501709,"d":"15.01.7.09"}]
[null,"PA","Brasil Novo","PA - Brasil Novo",{"v":1501725,"d":"15.01.7.25"}]
[null,"PA","Brejo Grande do Araguaia","PA - Brejo Grande do Araguaia",{"v":1501758,"d":"15.01.7.58"}]
[null,"PA","Breu Branco","PA - Breu Branco",{"v":1501782,"d":"15.01.7.82"}]
[null,"PA","Breves","PA - Breves",{"v":1501808,"d":"15.01.8.08"}]
[null,"PA","Bujaru","PA - Bujaru",{"v":1501907,"d":"15.01.9.07"}]
[null,"PA","Cachoeira do Arari","PA - Cachoeira do Arari",{"v":1502004,"d":"15.02.0.04"}]
[null,"PA","Cachoeira do Piriá","PA - Cachoeira do Piriá",{"v":1501956,"d":"15.01.9.56"}]
[null,"PA","Cametá","PA - Cametá",{"v":1502103,"d":"15.02.1.03"}]
[null,"PA","Canaã dos Carajás","PA - Canaã dos Carajás",{"v":1502152,"d":"15.02.1.52"}]
[null,"PA","Capanema","PA - Capanema",{"v":1502202,"d":"15.02.2.02"}]
[null,"PA","Capitão Poço","PA - Capitão Poço",{"v":1502301,"d":"15.02.3.01"}]
[null,"PA","Castanhal","PA - Castanhal",{"v":1502400,"d":"15.02.4.00"}]
[null,"PA","Chaves","PA - Chaves",{"v":1502509,"d":"15.02.5.09"}]
[null,"PA","Colares","PA - Colares",{"v":1502608,"d":"15.02.6.08"}]
[null,"PA","Conceição do Araguaia","PA - Conceição do Araguaia",{"v":1502707,"d":"15.02.7.07"}]
[null,"PA","Concórdia do Pará","PA - Concórdia do Pará",{"v":1502756,"d":"15.02.7.56"}]
[null,"PA","Cumaru do Norte","PA - Cumaru do Norte",{"v":1502764,"d":"15.02.7.64"}]
[null,"PA","Curionópolis","PA - Curionópolis",{"v":1502772,"d":"15.02.7.72"}]
[null,"PA","Curralinho","PA - Curralinho",{"v":1502806,"d":"15.02.8.06"}]
[null,"PA","Curuá","PA - Curuá",{"v":1502855,"d":"15.02.8.55"}]
[null,"PA","Curuçá","PA - Curuçá",{"v":1502905,"d":"15.02.9.05"}]
[null,"PA","Dom Eliseu","PA - Dom Eliseu",{"v":1502939,"d":"15.02.9.39"}]
[null,"PA","Eldorado dos Carajás","PA - Eldorado dos Carajás",{"v":1502954,"d":"15.02.9.54"}]
[null,"PA","Faro","PA - Faro",{"v":1503002,"d":"15.03.0.02"}]
[null,"PA","Floresta do Araguaia","PA - Floresta do Araguaia",{"v":1503044,"d":"15.03.0.44"}]
[null,"PA","Garrafão do Norte","PA - Garrafão do Norte",{"v":1503077,"d":"15.03.0.77"}]
[null,"PA","Goianésia do Pará","PA - Goianésia do Pará",{"v":1503093,"d":"15.03.0.93"}]
[null,"PA","Gurupá","PA - Gurupá",{"v":1503101,"d":"15.03.1.01"}]
[null,"PA","Igarapé-Açu","PA - Igarapé-Açu",{"v":1503200,"d":"15.03.2.00"}]
[null,"PA","Igarapé-Miri","PA - Igarapé-Miri",{"v":1503309,"d":"15.03.3.09"}]
[null,"PA","Inhangapi","PA - Inhangapi",{"v":1503408,"d":"15.03.4.08"}]
[null,"PA","Ipixuna do Pará","PA - Ipixuna do Pará",{"v":1503457,"d":"15.03.4.57"}]
[null,"PA","Irituia","PA - Irituia",{"v":1503507,"d":"15.03.5.07"}]
[null,"PA","Itaituba","PA - Itaituba",{"v":1503606,"d":"15.03.6.06"}]
[null,"PA","Itupiranga","PA - Itupiranga",{"v":1503705,"d":"15.03.7.05"}]
[null,"PA","Jacareacanga","PA - Jacareacanga",{"v":1503754,"d":"15.03.7.54"}]
[null,"PA","Jacundá","PA - Jacundá",{"v":1503804,"d":"15.03.8.04"}]
[null,"PA","Juruti","PA - Juruti",{"v":1503903,"d":"15.03.9.03"}]
[null,"PA","Limoeiro do Ajuru","PA - Limoeiro do Ajuru",{"v":1504000,"d":"15.04.0.00"}]
[null,"PA","Mãe do Rio","PA - Mãe do Rio",{"v":1504059,"d":"15.04.0.59"}]
[null,"PA","Magalhães Barata","PA - Magalhães Barata",{"v":1504109,"d":"15.04.1.09"}]
[null,"PA","Marabá","PA - Marabá",{"v":1504208,"d":"15.04.2.08"}]
[null,"PA","Maracanã","PA - Maracanã",{"v":1504307,"d":"15.04.3.07"}]
[null,"PA","Marapanim","PA - Marapanim",{"v":1504406,"d":"15.04.4.06"}]
[null,"PA","Marituba","PA - Marituba",{"v":1504422,"d":"15.04.4.22"}]
[null,"PA","Medicilândia","PA - Medicilândia",{"v":1504455,"d":"15.04.4.55"}]
[null,"PA","Melgaço","PA - Melgaço",{"v":1504505,"d":"15.04.5.05"}]
[null,"PA","Mocajuba","PA - Mocajuba",{"v":1504604,"d":"15.04.6.04"}]
[null,"PA","Moju","PA - Moju",{"v":1504703,"d":"15.04.7.03"}]
[null,"PA","Monte Alegre","PA - Monte Alegre",{"v":1504802,"d":"15.04.8.02"}]
[null,"PA","Muaná","PA - Muaná",{"v":1504901,"d":"15.04.9.01"}]
[null,"PA","Nova Esperança do Piriá",{"$f":"CONCATENATE(B2527,\" - \",C2527)","v":"PA - Nova Esperança do Piriá"},{"v":1504950,"d":"15.04.9.50"}]
[null,"PA","Nova Ipixuna","PA - Nova Ipixuna",{"v":1504976,"d":"15.04.9.76"}]
[null,"PA","Nova Timboteua","PA - Nova Timboteua",{"v":1505007,"d":"15.05.0.07"}]
[null,"PA","Novo Progresso","PA - Novo Progresso",{"v":1505031,"d":"15.05.0.31"}]
[null,"PA","Novo Repartimento","PA - Novo Repartimento",{"v":1505064,"d":"15.05.0.64"}]
[null,"PA","Óbidos","PA - Óbidos",{"v":1505106,"d":"15.05.1.06"}]
[null,"PA","Oeiras do Pará","PA - Oeiras do Pará",{"v":1505205,"d":"15.05.2.05"}]
[null,"PA","Oriximiná","PA - Oriximiná",{"v":1505304,"d":"15.05.3.04"}]
[null,"PA","Ourém","PA - Ourém",{"v":1505403,"d":"15.05.4.03"}]
[null,"PA","Ourilândia do Norte","PA - Ourilândia do Norte",{"v":1505437,"d":"15.05.4.37"}]
[null,"PA","Pacajá","PA - Pacajá",{"v":1505486,"d":"15.05.4.86"}]
[null,"PA","Palestina do Pará","PA - Palestina do Pará",{"v":1505494,"d":"15.05.4.94"}]
[null,"PA","Paragominas","PA - Paragominas",{"v":1505502,"d":"15.05.5.02"}]
[null,"PA","Parauapebas","PA - Parauapebas",{"v":1505536,"d":"15.05.5.36"}]
[null,"PA","Pau D'Arco","PA - Pau D'Arco",{"v":1505551,"d":"15.05.5.51"}]
[null,"PA","Peixe-Boi","PA - Peixe-Boi",{"v":1505601,"d":"15.05.6.01"}]
[null,"PA","Piçarra","PA - Piçarra",{"v":1505635,"d":"15.05.6.35"}]
[null,"PA","Placas","PA - Placas",{"v":1505650,"d":"15.05.6.50"}]
[null,"PA","Ponta de Pedras","PA - Ponta de Pedras",{"v":1505700,"d":"15.05.7.00"}]
[null,"PA","Portel","PA - Portel",{"v":1505809,"d":"15.05.8.09"}]
[null,"PA","Porto de Moz","PA - Porto de Moz",{"v":1505908,"d":"15.05.9.08"}]
[null,"PA","Prainha","PA - Prainha",{"v":1506005,"d":"15.06.0.05"}]
[null,"PA","Primavera","PA - Primavera",{"v":1506104,"d":"15.06.1.04"}]
[null,"PA","Quatipuru","PA - Quatipuru",{"v":1506112,"d":"15.06.1.12"}]
[null,"PA","Redenção","PA - Redenção",{"v":1506138,"d":"15.06.1.38"}]
[null,"PA","Rio Maria","PA - Rio Maria",{"v":1506161,"d":"15.06.1.61"}]
[null,"PA","Rondon do Pará","PA - Rondon do Pará",{"v":1506187,"d":"15.06.1.87"}]
[null,"PA","Rurópolis","PA - Rurópolis",{"v":1506195,"d":"15.06.1.95"}]
[null,"PA","Salinópolis","PA - Salinópolis",{"v":1506203,"d":"15.06.2.03"}]
[null,"PA","Salvaterra","PA - Salvaterra",{"v":1506302,"d":"15.06.3.02"}]
[null,"PA","Santa Bárbara do Pará","PA - Santa Bárbara do Pará",{"v":1506351,"d":"15.06.3.51"}]
[null,"PA","Santa Cruz do Arari","PA - Santa Cruz do Arari",{"v":1506401,"d":"15.06.4.01"}]
[null,"PA","Santa Isabel do Pará","PA - Santa Isabel do Pará",{"v":1506500,"d":"15.06.5.00"}]
[null,"PA","Santa Luzia do Pará","PA - Santa Luzia do Pará",{"v":1506559,"d":"15.06.5.59"}]
[null,"PA","Santa Maria das Barreiras","PA - Santa Maria das Barreiras",{"v":1506583,"d":"15.06.5.83"}]
[null,"PA","Santa Maria do Pará","PA - Santa Maria do Pará",{"v":1506609,"d":"15.06.6.09"}]
[null,"PA","Santana do Araguaia","PA - Santana do Araguaia",{"v":1506708,"d":"15.06.7.08"}]
[null,"PA","Santarém","PA - Santarém",{"v":1506807,"d":"15.06.8.07"}]
[null,"PA","Santarém Novo","PA - Santarém Novo",{"v":1506906,"d":"15.06.9.06"}]
[null,"PA","Santo Antônio do Tauá","PA - Santo Antônio do Tauá",{"v":1507003,"d":"15.07.0.03"}]
[null,"PA","São Caetano de Odivelas","PA - São Caetano de Odivelas",{"v":1507102,"d":"15.07.1.02"}]
[null,"PA","São Domingos do Araguaia","PA - São Domingos do Araguaia",{"v":1507151,"d":"15.07.1.51"}]
[null,"PA","São Domingos do Capim","PA - São Domingos do Capim",{"v":1507201,"d":"15.07.2.01"}]
[null,"PA","São Félix do Xingu","PA - São Félix do Xingu",{"v":1507300,"d":"15.07.3.00"}]
[null,"PA","São Francisco do Pará","PA - São Francisco do Pará",{"v":1507409,"d":"15.07.4.09"}]
[null,"PA","São Geraldo do Araguaia","PA - São Geraldo do Araguaia",{"v":1507458,"d":"15.07.4.58"}]
[null,"PA","São João da Ponta","PA - São João da Ponta",{"v":1507466,"d":"15.07.4.66"}]
[null,"PA","São João de Pirabas","PA - São João de Pirabas",{"v":1507474,"d":"15.07.4.74"}]
[null,"PA","São João do Araguaia","PA - São João do Araguaia",{"v":1507508,"d":"15.07.5.08"}]
[null,"PA","São Miguel do Guamá","PA - São Miguel do Guamá",{"v":1507607,"d":"15.07.6.07"}]
[null,"PA","São Sebastião da Boa Vista","PA - São Sebastião da Boa Vista",{"v":1507706,"d":"15.07.7.06"}]
[null,"PA","Sapucaia","PA - Sapucaia",{"v":1507755,"d":"15.07.7.55"}]
[null,"PA","Senador José Porfírio","PA - Senador José Porfírio",{"v":1507805,"d":"15.07.8.05"}]
[null,"PA","Soure","PA - Soure",{"v":1507904,"d":"15.07.9.04"}]
[null,"PA","Tailândia","PA - Tailândia",{"v":1507953,"d":"15.07.9.53"}]
[null,"PA","Terra Alta","PA - Terra Alta",{"v":1507961,"d":"15.07.9.61"}]
[null,"PA","Terra Santa","PA - Terra Santa",{"v":1507979,"d":"15.07.9.79"}]
[null,"PA","Tomé-Açu","PA - Tomé-Açu",{"v":1508001,"d":"15.08.0.01"}]
[null,"PA","Tracuateua","PA - Tracuateua",{"v":1508035,"d":"15.08.0.35"}]
[null,"PA","Trairão","PA - Trairão",{"v":1508050,"d":"15.08.0.50"}]
[null,"PA","Tucumã","PA - Tucumã",{"v":1508084,"d":"15.08.0.84"}]
[null,"PA","Tucuruí","PA - Tucuruí",{"v":1508100,"d":"15.08.1.00"}]
[null,"PA","Ulianópolis","PA - Ulianópolis",{"v":1508126,"d":"15.08.1.26"}]
[null,"PA","Uruará","PA - Uruará",{"v":1508159,"d":"15.08.1.59"}]
[null,"PA","Vigia",{"$f":"CONCATENATE(B2591,\" - \",C2591)","v":"PA - Vigia"},{"v":1508209,"d":"15.08.2.09"}]
[null,"PA","Viseu","PA - Viseu",{"v":1508308,"d":"15.08.3.08"}]
[null,"PA","Vitória do Xingu","PA - Vitória do Xingu",{"v":1508357,"d":"15.08.3.57"}]
[null,"PA","Xinguara","PA - Xinguara",{"v":1508407,"d":"15.08.4.07"}]
[null,"PB","Água Branca","PB - Água Branca",{"v":2500106,"d":"25.00.1.06"}]
[null,"PB","Aguiar","PB - Aguiar",{"v":2500205,"d":"25.00.2.05"}]
[null,"PB","Alagoa Grande","PB - Alagoa Grande",{"v":2500304,"d":"25.00.3.04"}]
[null,"PB","Alagoa Nova","PB - Alagoa Nova",{"v":2500403,"d":"25.00.4.03"}]
[null,"PB","Alagoinha","PB - Alagoinha",{"v":2500502,"d":"25.00.5.02"}]
[null,"PB","Alcantil","PB - Alcantil",{"v":2500536,"d":"25.00.5.36"}]
[null,"PB","Algodão de Jandaíra","PB - Algodão de Jandaíra",{"v":2500577,"d":"25.00.5.77"}]
[null,"PB","Alhandra","PB - Alhandra",{"v":2500601,"d":"25.00.6.01"}]
[null,"PB","Amparo","PB - Amparo",{"v":2500734,"d":"25.00.7.34"}]
[null,"PB","Aparecida","PB - Aparecida",{"v":2500775,"d":"25.00.7.75"}]
[null,"PB","Araçagi","PB - Araçagi",{"v":2500809,"d":"25.00.8.09"}]
[null,"PB","Arara","PB - Arara",{"v":2500908,"d":"25.00.9.08"}]
[null,"PB","Araruna","PB - Araruna",{"v":2501005,"d":"25.01.0.05"}]
[null,"PB","Areia","PB - Areia",{"v":2501104,"d":"25.01.1.04"}]
[null,"PB","Areia de Baraúnas","PB - Areia de Baraúnas",{"v":2501153,"d":"25.01.1.53"}]
[null,"PB","Areial","PB - Areial",{"v":2501203,"d":"25.01.2.03"}]
[null,"PB","Aroeiras","PB - Aroeiras",{"v":2501302,"d":"25.01.3.02"}]
[null,"PB","Assunção","PB - Assunção",{"v":2501351,"d":"25.01.3.51"}]
[null,"PB","Baía da Traição","PB - Baía da Traição",{"v":2501401,"d":"25.01.4.01"}]
[null,"PB","Bananeiras","PB - Bananeiras",{"v":2501500,"d":"25.01.5.00"}]
[null,"PB","Baraúna","PB - Baraúna",{"v":2501534,"d":"25.01.5.34"}]
[null,"PB","Barra de Santa Rosa","PB - Barra de Santa Rosa",{"v":2501609,"d":"25.01.6.09"}]
[null,"PB","Barra de Santana","PB - Barra de Santana",{"v":2501575,"d":"25.01.5.75"}]
[null,"PB","Barra de São Miguel","PB - Barra de São Miguel",{"v":2501708,"d":"25.01.7.08"}]
[null,"PB","Bayeux","PB - Bayeux",{"v":2501807,"d":"25.01.8.07"}]
[null,"PB","Belém","PB - Belém",{"v":2501906,"d":"25.01.9.06"}]
[null,"PB","Belém do Brejo do Cruz","PB - Belém do Brejo do Cruz",{"v":2502003,"d":"25.02.0.03"}]
[null,"PB","Bernardino Batista","PB - Bernardino Batista",{"v":2502052,"d":"25.02.0.52"}]
[null,"PB","Boa Ventura","PB - Boa Ventura",{"v":2502102,"d":"25.02.1.02"}]
[null,"PB","Boa Vista","PB - Boa Vista",{"v":2502151,"d":"25.02.1.51"}]
[null,"PB","Bom Jesus","PB - Bom Jesus",{"v":2502201,"d":"25.02.2.01"}]
[null,"PB","Bom Sucesso","PB - Bom Sucesso",{"v":2502300,"d":"25.02.3.00"}]
[null,"PB","Bonito de Santa Fé","PB - Bonito de Santa Fé",{"v":2502409,"d":"25.02.4.09"}]
[null,"PB","Boqueirão","PB - Boqueirão",{"v":2502508,"d":"25.02.5.08"}]
[null,"PB","Borborema","PB - Borborema",{"v":2502706,"d":"25.02.7.06"}]
[null,"PB","Brejo do Cruz","PB - Brejo do Cruz",{"v":2502805,"d":"25.02.8.05"}]
[null,"PB","Brejo dos Santos","PB - Brejo dos Santos",{"v":2502904,"d":"25.02.9.04"}]
[null,"PB","Caaporã","PB - Caaporã",{"v":2503001,"d":"25.03.0.01"}]
[null,"PB","Cabaceiras","PB - Cabaceiras",{"v":2503100,"d":"25.03.1.00"}]
[null,"PB","Cabedelo","PB - Cabedelo",{"v":2503209,"d":"25.03.2.09"}]
[null,"PB","Cachoeira dos Índios","PB - Cachoeira dos Índios",{"v":2503308,"d":"25.03.3.08"}]
[null,"PB","Cacimba de Areia","PB - Cacimba de Areia",{"v":2503407,"d":"25.03.4.07"}]
[null,"PB","Cacimba de Dentro","PB - Cacimba de Dentro",{"v":2503506,"d":"25.03.5.06"}]
[null,"PB","Cacimbas","PB - Cacimbas",{"v":2503555,"d":"25.03.5.55"}]
[null,"PB","Caiçara","PB - Caiçara",{"v":2503605,"d":"25.03.6.05"}]
[null,"PB","Cajazeiras","PB - Cajazeiras",{"v":2503704,"d":"25.03.7.04"}]
[null,"PB","Cajazeirinhas","PB - Cajazeirinhas",{"v":2503753,"d":"25.03.7.53"}]
[null,"PB","Caldas Brandão","PB - Caldas Brandão",{"v":2503803,"d":"25.03.8.03"}]
[null,"PB","Camalaú","PB - Camalaú",{"v":2503902,"d":"25.03.9.02"}]
[null,"PB","Campina Grande","PB - Campina Grande",{"v":2504009,"d":"25.04.0.09"}]
[null,"PB","Capim","PB - Capim",{"v":2504033,"d":"25.04.0.33"}]
[null,"PB","Caraúbas","PB - Caraúbas",{"v":2504074,"d":"25.04.0.74"}]
[null,"PB","Carrapateira","PB - Carrapateira",{"v":2504108,"d":"25.04.1.08"}]
[null,"PB","Casserengue","PB - Casserengue",{"v":2504157,"d":"25.04.1.57"}]
[null,"PB","Catingueira","PB - Catingueira",{"v":2504207,"d":"25.04.2.07"}]
[null,"PB","Catolé do Rocha","PB - Catolé do Rocha",{"v":2504306,"d":"25.04.3.06"}]
[null,"PB","Caturité","PB - Caturité",{"v":2504355,"d":"25.04.3.55"}]
[null,"PB","Conceição","PB - Conceição",{"v":2504405,"d":"25.04.4.05"}]
[null,"PB","Condado","PB - Condado",{"v":2504504,"d":"25.04.5.04"}]
[null,"PB","Conde","PB - Conde",{"v":2504603,"d":"25.04.6.03"}]
[null,"PB","Congo",{"$f":"CONCATENATE(B2655,\" - \",C2655)","v":"PB - Congo"},{"v":2504702,"d":"25.04.7.02"}]
[null,"PB","Coremas","PB - Coremas",{"v":2504801,"d":"25.04.8.01"}]
[null,"PB","Coxixola","PB - Coxixola",{"v":2504850,"d":"25.04.8.50"}]
[null,"PB","Cruz do Espírito Santo","PB - Cruz do Espírito Santo",{"v":2504900,"d":"25.04.9.00"}]
[null,"PB","Cubati","PB - Cubati",{"v":2505006,"d":"25.05.0.06"}]
[null,"PB","Cuité","PB - Cuité",{"v":2505105,"d":"25.05.1.05"}]
[null,"PB","Cuité de Mamanguape","PB - Cuité de Mamanguape",{"v":2505238,"d":"25.05.2.38"}]
[null,"PB","Cuitegi","PB - Cuitegi",{"v":2505204,"d":"25.05.2.04"}]
[null,"PB","Curral de Cima","PB - Curral de Cima",{"v":2505279,"d":"25.05.2.79"}]
[null,"PB","Curral Velho","PB - Curral Velho",{"v":2505303,"d":"25.05.3.03"}]
[null,"PB","Damião","PB - Damião",{"v":2505352,"d":"25.05.3.52"}]
[null,"PB","Desterro","PB - Desterro",{"v":2505402,"d":"25.05.4.02"}]
[null,"PB","Diamante","PB - Diamante",{"v":2505600,"d":"25.05.6.00"}]
[null,"PB","Dona Inês","PB - Dona Inês",{"v":2505709,"d":"25.05.7.09"}]
[null,"PB","Duas Estradas","PB - Duas Estradas",{"v":2505808,"d":"25.05.8.08"}]
[null,"PB","Emas","PB - Emas",{"v":2505907,"d":"25.05.9.07"}]
[null,"PB","Esperança","PB - Esperança",{"v":2506004,"d":"25.06.0.04"}]
[null,"PB","Fagundes","PB - Fagundes",{"v":2506103,"d":"25.06.1.03"}]
[null,"PB","Frei Martinho","PB - Frei Martinho",{"v":2506202,"d":"25.06.2.02"}]
[null,"PB","Gado Bravo","PB - Gado Bravo",{"v":2506251,"d":"25.06.2.51"}]
[null,"PB","Guarabira","PB - Guarabira",{"v":2506301,"d":"25.06.3.01"}]
[null,"PB","Gurinhém","PB - Gurinhém",{"v":2506400,"d":"25.06.4.00"}]
[null,"PB","Gurjão","PB - Gurjão",{"v":2506509,"d":"25.06.5.09"}]
[null,"PB","Ibiara","PB - Ibiara",{"v":2506608,"d":"25.06.6.08"}]
[null,"PB","Igaracy","PB - Igaracy",{"v":2502607,"d":"25.02.6.07"}]
[null,"PB","Imaculada","PB - Imaculada",{"v":2506707,"d":"25.06.7.07"}]
[null,"PB","Ingá","PB - Ingá",{"v":2506806,"d":"25.06.8.06"}]
[null,"PB","Itabaiana","PB - Itabaiana",{"v":2506905,"d":"25.06.9.05"}]
[null,"PB","Itaporanga","PB - Itaporanga",{"v":2507002,"d":"25.07.0.02"}]
[null,"PB","Itapororoca","PB - Itapororoca",{"v":2507101,"d":"25.07.1.01"}]
[null,"PB","Itatuba","PB - Itatuba",{"v":2507200,"d":"25.07.2.00"}]
[null,"PB","Jacaraú","PB - Jacaraú",{"v":2507309,"d":"25.07.3.09"}]
[null,"PB","Jericó","PB - Jericó",{"v":2507408,"d":"25.07.4.08"}]
[null,"PB","João Pessoa","PB - João Pessoa",{"v":2507507,"d":"25.07.5.07"}]
[null,"PB","Joca Claudino","PB - Joca Claudino",{"v":2513653,"d":"25.13.6.53"}]
[null,"PB","Juarez Távora","PB - Juarez Távora",{"v":2507606,"d":"25.07.6.06"}]
[null,"PB","Juazeirinho","PB - Juazeirinho",{"v":2507705,"d":"25.07.7.05"}]
[null,"PB","Junco do Seridó","PB - Junco do Seridó",{"v":2507804,"d":"25.07.8.04"}]
[null,"PB","Juripiranga","PB - Juripiranga",{"v":2507903,"d":"25.07.9.03"}]
[null,"PB","Juru","PB - Juru",{"v":2508000,"d":"25.08.0.00"}]
[null,"PB","Lagoa","PB - Lagoa",{"v":2508109,"d":"25.08.1.09"}]
[null,"PB","Lagoa de Dentro","PB - Lagoa de Dentro",{"v":2508208,"d":"25.08.2.08"}]
[null,"PB","Lagoa Seca","PB - Lagoa Seca",{"v":2508307,"d":"25.08.3.07"}]
[null,"PB","Lastro","PB - Lastro",{"v":2508406,"d":"25.08.4.06"}]
[null,"PB","Livramento","PB - Livramento",{"v":2508505,"d":"25.08.5.05"}]
[null,"PB","Logradouro","PB - Logradouro",{"v":2508554,"d":"25.08.5.54"}]
[null,"PB","Lucena","PB - Lucena",{"v":2508604,"d":"25.08.6.04"}]
[null,"PB","Mãe d'Água","PB - Mãe d'Água",{"v":2508703,"d":"25.08.7.03"}]
[null,"PB","Malta","PB - Malta",{"v":2508802,"d":"25.08.8.02"}]
[null,"PB","Mamanguape","PB - Mamanguape",{"v":2508901,"d":"25.08.9.01"}]
[null,"PB","Manaíra","PB - Manaíra",{"v":2509008,"d":"25.09.0.08"}]
[null,"PB","Marcação","PB - Marcação",{"v":2509057,"d":"25.09.0.57"}]
[null,"PB","Mari","PB - Mari",{"v":2509107,"d":"25.09.1.07"}]
[null,"PB","Marizópolis","PB - Marizópolis",{"v":2509156,"d":"25.09.1.56"}]
[null,"PB","Massaranduba","PB - Massaranduba",{"v":2509206,"d":"25.09.2.06"}]
[null,"PB","Mataraca","PB - Mataraca",{"v":2509305,"d":"25.09.3.05"}]
[null,"PB","Matinhas","PB - Matinhas",{"v":2509339,"d":"25.09.3.39"}]
[null,"PB","Mato Grosso","PB - Mato Grosso",{"v":2509370,"d":"25.09.3.70"}]
[null,"PB","Maturéia","PB - Maturéia",{"v":2509396,"d":"25.09.3.96"}]
[null,"PB","Mogeiro","PB - Mogeiro",{"v":2509404,"d":"25.09.4.04"}]
[null,"PB","Montadas","PB - Montadas",{"v":2509503,"d":"25.09.5.03"}]
[null,"PB","Monte Horebe","PB - Monte Horebe",{"v":2509602,"d":"25.09.6.02"}]
[null,"PB","Monteiro","PB - Monteiro",{"v":2509701,"d":"25.09.7.01"}]
[null,"PB","Mulungu","PB - Mulungu",{"v":2509800,"d":"25.09.8.00"}]
[null,"PB","Natuba",{"$f":"CONCATENATE(B2719,\" - \",C2719)","v":"PB - Natuba"},{"v":2509909,"d":"25.09.9.09"}]
[null,"PB","Nazarezinho","PB - Nazarezinho",{"v":2510006,"d":"25.10.0.06"}]
[null,"PB","Nova Floresta","PB - Nova Floresta",{"v":2510105,"d":"25.10.1.05"}]
[null,"PB","Nova Olinda","PB - Nova Olinda",{"v":2510204,"d":"25.10.2.04"}]
[null,"PB","Nova Palmeira","PB - Nova Palmeira",{"v":2510303,"d":"25.10.3.03"}]
[null,"PB","Olho d'Água","PB - Olho d'Água",{"v":2510402,"d":"25.10.4.02"}]
[null,"PB","Olivedos","PB - Olivedos",{"v":2510501,"d":"25.10.5.01"}]
[null,"PB","Ouro Velho","PB - Ouro Velho",{"v":2510600,"d":"25.10.6.00"}]
[null,"PB","Parari","PB - Parari",{"v":2510659,"d":"25.10.6.59"}]
[null,"PB","Passagem","PB - Passagem",{"v":2510709,"d":"25.10.7.09"}]
[null,"PB","Patos","PB - Patos",{"v":2510808,"d":"25.10.8.08"}]
[null,"PB","Paulista","PB - Paulista",{"v":2510907,"d":"25.10.9.07"}]
[null,"PB","Pedra Branca","PB - Pedra Branca",{"v":2511004,"d":"25.11.0.04"}]
[null,"PB","Pedra Lavrada","PB - Pedra Lavrada",{"v":2511103,"d":"25.11.1.03"}]
[null,"PB","Pedras de Fogo","PB - Pedras de Fogo",{"v":2511202,"d":"25.11.2.02"}]
[null,"PB","Pedro Régis","PB - Pedro Régis",{"v":2512721,"d":"25.12.7.21"}]
[null,"PB","Piancó","PB - Piancó",{"v":2511301,"d":"25.11.3.01"}]
[null,"PB","Picuí","PB - Picuí",{"v":2511400,"d":"25.11.4.00"}]
[null,"PB","Pilar","PB - Pilar",{"v":2511509,"d":"25.11.5.09"}]
[null,"PB","Pilões","PB - Pilões",{"v":2511608,"d":"25.11.6.08"}]
[null,"PB","Pilõezinhos","PB - Pilõezinhos",{"v":2511707,"d":"25.11.7.07"}]
[null,"PB","Pirpirituba","PB - Pirpirituba",{"v":2511806,"d":"25.11.8.06"}]
[null,"PB","Pitimbu","PB - Pitimbu",{"v":2511905,"d":"25.11.9.05"}]
[null,"PB","Pocinhos","PB - Pocinhos",{"v":2512002,"d":"25.12.0.02"}]
[null,"PB","Poço Dantas","PB - Poço Dantas",{"v":2512036,"d":"25.12.0.36"}]
[null,"PB","Poço de José de Moura","PB - Poço de José de Moura",{"v":2512077,"d":"25.12.0.77"}]
[null,"PB","Pombal","PB - Pombal",{"v":2512101,"d":"25.12.1.01"}]
[null,"PB","Prata","PB - Prata",{"v":2512200,"d":"25.12.2.00"}]
[null,"PB","Princesa Isabel","PB - Princesa Isabel",{"v":2512309,"d":"25.12.3.09"}]
[null,"PB","Puxinanã","PB - Puxinanã",{"v":2512408,"d":"25.12.4.08"}]
[null,"PB","Queimadas","PB - Queimadas",{"v":2512507,"d":"25.12.5.07"}]
[null,"PB","Quixabá","PB - Quixabá",{"v":2512606,"d":"25.12.6.06"}]
[null,"PB","Remígio","PB - Remígio",{"v":2512705,"d":"25.12.7.05"}]
[null,"PB","Riachão","PB - Riachão",{"v":2512747,"d":"25.12.7.47"}]
[null,"PB","Riachão do Bacamarte","PB - Riachão do Bacamarte",{"v":2512754,"d":"25.12.7.54"}]
[null,"PB","Riachão do Poço","PB - Riachão do Poço",{"v":2512762,"d":"25.12.7.62"}]
[null,"PB","Riacho de Santo Antônio","PB - Riacho de Santo Antônio",{"v":2512788,"d":"25.12.7.88"}]
[null,"PB","Riacho dos Cavalos","PB - Riacho dos Cavalos",{"v":2512804,"d":"25.12.8.04"}]
[null,"PB","Rio Tinto","PB - Rio Tinto",{"v":2512903,"d":"25.12.9.03"}]
[null,"PB","Salgadinho","PB - Salgadinho",{"v":2513000,"d":"25.13.0.00"}]
[null,"PB","Salgado de São Félix","PB - Salgado de São Félix",{"v":2513109,"d":"25.13.1.09"}]
[null,"PB","Santa Cecília","PB - Santa Cecília",{"v":2513158,"d":"25.13.1.58"}]
[null,"PB","Santa Cruz","PB - Santa Cruz",{"v":2513208,"d":"25.13.2.08"}]
[null,"PB","Santa Helena","PB - Santa Helena",{"v":2513307,"d":"25.13.3.07"}]
[null,"PB","Santa Inês","PB - Santa Inês",{"v":2513356,"d":"25.13.3.56"}]
[null,"PB","Santa Luzia","PB - Santa Luzia",{"v":2513406,"d":"25.13.4.06"}]
[null,"PB","Santa Rita","PB - Santa Rita",{"v":2513703,"d":"25.13.7.03"}]
[null,"PB","Santa Teresinha","PB - Santa Teresinha",{"v":2513802,"d":"25.13.8.02"}]
[null,"PB","Santana de Mangueira","PB - Santana de Mangueira",{"v":2513505,"d":"25.13.5.05"}]
[null,"PB","Santana dos Garrotes","PB - Santana dos Garrotes",{"v":2513604,"d":"25.13.6.04"}]
[null,"PB","Santo André","PB - Santo André",{"v":2513851,"d":"25.13.8.51"}]
[null,"PB","São Bentinho","PB - São Bentinho",{"v":2513927,"d":"25.13.9.27"}]
[null,"PB","São Bento","PB - São Bento",{"v":2513901,"d":"25.13.9.01"}]
[null,"PB","São Domingos","PB - São Domingos",{"v":2513968,"d":"25.13.9.68"}]
[null,"PB","São Domingos do Cariri","PB - São Domingos do Cariri",{"v":2513943,"d":"25.13.9.43"}]
[null,"PB","São Francisco","PB - São Francisco",{"v":2513984,"d":"25.13.9.84"}]
[null,"PB","São João do Cariri","PB - São João do Cariri",{"v":2514008,"d":"25.14.0.08"}]
[null,"PB","São João do Rio do Peixe","PB - São João do Rio do Peixe",{"v":2500700,"d":"25.00.7.00"}]
[null,"PB","São João do Tigre","PB - São João do Tigre",{"v":2514107,"d":"25.14.1.07"}]
[null,"PB","São José da Lagoa Tapada","PB - São José da Lagoa Tapada",{"v":2514206,"d":"25.14.2.06"}]
[null,"PB","São José de Caiana","PB - São José de Caiana",{"v":2514305,"d":"25.14.3.05"}]
[null,"PB","São José de Espinharas","PB - São José de Espinharas",{"v":2514404,"d":"25.14.4.04"}]
[null,"PB","São José de Piranhas","PB - São José de Piranhas",{"v":2514503,"d":"25.14.5.03"}]
[null,"PB","São José de Princesa","PB - São José de Princesa",{"v":2514552,"d":"25.14.5.52"}]
[null,"PB","São José do Bonfim",{"$f":"CONCATENATE(B2783,\" - \",C2783)","v":"PB - São José do Bonfim"},{"v":2514602,"d":"25.14.6.02"}]
[null,"PB","São José do Brejo do Cruz","PB - São José do Brejo do Cruz",{"v":2514651,"d":"25.14.6.51"}]
[null,"PB","São José do Sabugi","PB - São José do Sabugi",{"v":2514701,"d":"25.14.7.01"}]
[null,"PB","São José dos Cordeiros","PB - São José dos Cordeiros",{"v":2514800,"d":"25.14.8.00"}]
[null,"PB","São José dos Ramos","PB - São José dos Ramos",{"v":2514453,"d":"25.14.4.53"}]
[null,"PB","São Mamede","PB - São Mamede",{"v":2514909,"d":"25.14.9.09"}]
[null,"PB","São Miguel de Taipu","PB - São Miguel de Taipu",{"v":2515005,"d":"25.15.0.05"}]
[null,"PB","São Sebastião de Lagoa de Roça","PB - São Sebastião de Lagoa de Roça",{"v":2515104,"d":"25.15.1.04"}]
[null,"PB","São Sebastião do Umbuzeiro","PB - São Sebastião do Umbuzeiro",{"v":2515203,"d":"25.15.2.03"}]
[null,"PB","Sapé","PB - Sapé",{"v":2515302,"d":"25.15.3.02"}]
[null,"PB","Seridó","PB - Seridó",{"v":2515401,"d":"25.15.4.01"}]
[null,"PB","Serra Branca","PB - Serra Branca",{"v":2515500,"d":"25.15.5.00"}]
[null,"PB","Serra da Raiz","PB - Serra da Raiz",{"v":2515609,"d":"25.15.6.09"}]
[null,"PB","Serra Grande","PB - Serra Grande",{"v":2515708,"d":"25.15.7.08"}]
[null,"PB","Serra Redonda","PB - Serra Redonda",{"v":2515807,"d":"25.15.8.07"}]
[null,"PB","Serraria","PB - Serraria",{"v":2515906,"d":"25.15.9.06"}]
[null,"PB","Sertãozinho","PB - Sertãozinho",{"v":2515930,"d":"25.15.9.30"}]
[null,"PB","Sobrado","PB - Sobrado",{"v":2515971,"d":"25.15.9.71"}]
[null,"PB","Solânea","PB - Solânea",{"v":2516003,"d":"25.16.0.03"}]
[null,"PB","Soledade","PB - Soledade",{"v":2516102,"d":"25.16.1.02"}]
[null,"PB","Sossêgo","PB - Sossêgo",{"v":2516151,"d":"25.16.1.51"}]
[null,"PB","Sousa","PB - Sousa",{"v":2516201,"d":"25.16.2.01"}]
[null,"PB","Sumé","PB - Sumé",{"v":2516300,"d":"25.16.3.00"}]
[null,"PB","Tacima","PB - Tacima",{"v":2516409,"d":"25.16.4.09"}]
[null,"PB","Taperoá","PB - Taperoá",{"v":2516508,"d":"25.16.5.08"}]
[null,"PB","Tavares","PB - Tavares",{"v":2516607,"d":"25.16.6.07"}]
[null,"PB","Teixeira","PB - Teixeira",{"v":2516706,"d":"25.16.7.06"}]
[null,"PB","Tenório","PB - Tenório",{"v":2516755,"d":"25.16.7.55"}]
[null,"PB","Triunfo","PB - Triunfo",{"v":2516805,"d":"25.16.8.05"}]
[null,"PB","Uiraúna","PB - Uiraúna",{"v":2516904,"d":"25.16.9.04"}]
[null,"PB","Umbuzeiro","PB - Umbuzeiro",{"v":2517001,"d":"25.17.0.01"}]
[null,"PB","Várzea","PB - Várzea",{"v":2517100,"d":"25.17.1.00"}]
[null,"PB","Vieirópolis","PB - Vieirópolis",{"v":2517209,"d":"25.17.2.09"}]
[null,"PB","Vista Serrana","PB - Vista Serrana",{"v":2505501,"d":"25.05.5.01"}]
[null,"PB","Zabelê","PB - Zabelê",{"v":2517407,"d":"25.17.4.07"}]
[null,"PE","Abreu e Lima","PE - Abreu e Lima",{"v":2600054,"d":"26.00.0.54"}]
[null,"PE","Afogados da Ingazeira","PE - Afogados da Ingazeira",{"v":2600104,"d":"26.00.1.04"}]
[null,"PE","Afrânio","PE - Afrânio",{"v":2600203,"d":"26.00.2.03"}]
[null,"PE","Agrestina","PE - Agrestina",{"v":2600302,"d":"26.00.3.02"}]
[null,"PE","Água Preta","PE - Água Preta",{"v":2600401,"d":"26.00.4.01"}]
[null,"PE","Águas Belas","PE - Águas Belas",{"v":2600500,"d":"26.00.5.00"}]
[null,"PE","Alagoinha","PE - Alagoinha",{"v":2600609,"d":"26.00.6.09"}]
[null,"PE","Aliança","PE - Aliança",{"v":2600708,"d":"26.00.7.08"}]
[null,"PE","Altinho","PE - Altinho",{"v":2600807,"d":"26.00.8.07"}]
[null,"PE","Amaraji","PE - Amaraji",{"v":2600906,"d":"26.00.9.06"}]
[null,"PE","Angelim","PE - Angelim",{"v":2601003,"d":"26.01.0.03"}]
[null,"PE","Araçoiaba","PE - Araçoiaba",{"v":2601052,"d":"26.01.0.52"}]
[null,"PE","Araripina","PE - Araripina",{"v":2601102,"d":"26.01.1.02"}]
[null,"PE","Arcoverde","PE - Arcoverde",{"v":2601201,"d":"26.01.2.01"}]
[null,"PE","Barra de Guabiraba","PE - Barra de Guabiraba",{"v":2601300,"d":"26.01.3.00"}]
[null,"PE","Barreiros","PE - Barreiros",{"v":2601409,"d":"26.01.4.09"}]
[null,"PE","Belém de Maria","PE - Belém de Maria",{"v":2601508,"d":"26.01.5.08"}]
[null,"PE","Belém do São Francisco","PE - Belém do São Francisco",{"v":2601607,"d":"26.01.6.07"}]
[null,"PE","Belo Jardim","PE - Belo Jardim",{"v":2601706,"d":"26.01.7.06"}]
[null,"PE","Betânia","PE - Betânia",{"v":2601805,"d":"26.01.8.05"}]
[null,"PE","Bezerros","PE - Bezerros",{"v":2601904,"d":"26.01.9.04"}]
[null,"PE","Bodocó","PE - Bodocó",{"v":2602001,"d":"26.02.0.01"}]
[null,"PE","Bom Conselho","PE - Bom Conselho",{"v":2602100,"d":"26.02.1.00"}]
[null,"PE","Bom Jardim","PE - Bom Jardim",{"v":2602209,"d":"26.02.2.09"}]
[null,"PE","Bonito","PE - Bonito",{"v":2602308,"d":"26.02.3.08"}]
[null,"PE","Brejão","PE - Brejão",{"v":2602407,"d":"26.02.4.07"}]
[null,"PE","Brejinho","PE - Brejinho",{"v":2602506,"d":"26.02.5.06"}]
[null,"PE","Brejo da Madre de Deus","PE - Brejo da Madre de Deus",{"v":2602605,"d":"26.02.6.05"}]
[null,"PE","Buenos Aires","PE - Buenos Aires",{"v":2602704,"d":"26.02.7.04"}]
[null,"PE","Buíque",{"$f":"CONCATENATE(B2847,\" - \",C2847)","v":"PE - Buíque"},{"v":2602803,"d":"26.02.8.03"}]
[null,"PE","Cabo de Santo Agostinho","PE - Cabo de Santo Agostinho",{"v":2602902,"d":"26.02.9.02"}]
[null,"PE","Cabrobó","PE - Cabrobó",{"v":2603009,"d":"26.03.0.09"}]
[null,"PE","Cachoeirinha","PE - Cachoeirinha",{"v":2603108,"d":"26.03.1.08"}]
[null,"PE","Caetés","PE - Caetés",{"v":2603207,"d":"26.03.2.07"}]
[null,"PE","Calçado","PE - Calçado",{"v":2603306,"d":"26.03.3.06"}]
[null,"PE","Calumbi","PE - Calumbi",{"v":2603405,"d":"26.03.4.05"}]
[null,"PE","Camaragibe","PE - Camaragibe",{"v":2603454,"d":"26.03.4.54"}]
[null,"PE","Camocim de São Félix","PE - Camocim de São Félix",{"v":2603504,"d":"26.03.5.04"}]
[null,"PE","Camutanga","PE - Camutanga",{"v":2603603,"d":"26.03.6.03"}]
[null,"PE","Canhotinho","PE - Canhotinho",{"v":2603702,"d":"26.03.7.02"}]
[null,"PE","Capoeiras","PE - Capoeiras",{"v":2603801,"d":"26.03.8.01"}]
[null,"PE","Carnaíba","PE - Carnaíba",{"v":2603900,"d":"26.03.9.00"}]
[null,"PE","Carnaubeira da Penha","PE - Carnaubeira da Penha",{"v":2603926,"d":"26.03.9.26"}]
[null,"PE","Carpina","PE - Carpina",{"v":2604007,"d":"26.04.0.07"}]
[null,"PE","Caruaru","PE - Caruaru",{"v":2604106,"d":"26.04.1.06"}]
[null,"PE","Casinhas","PE - Casinhas",{"v":2604155,"d":"26.04.1.55"}]
[null,"PE","Catende","PE - Catende",{"v":2604205,"d":"26.04.2.05"}]
[null,"PE","Cedro","PE - Cedro",{"v":2604304,"d":"26.04.3.04"}]
[null,"PE","Chã de Alegria","PE - Chã de Alegria",{"v":2604403,"d":"26.04.4.03"}]
[null,"PE","Chã Grande","PE - Chã Grande",{"v":2604502,"d":"26.04.5.02"}]
[null,"PE","Condado","PE - Condado",{"v":2604601,"d":"26.04.6.01"}]
[null,"PE","Correntes","PE - Correntes",{"v":2604700,"d":"26.04.7.00"}]
[null,"PE","Cortês","PE - Cortês",{"v":2604809,"d":"26.04.8.09"}]
[null,"PE","Cumaru","PE - Cumaru",{"v":2604908,"d":"26.04.9.08"}]
[null,"PE","Cupira","PE - Cupira",{"v":2605004,"d":"26.05.0.04"}]
[null,"PE","Custódia","PE - Custódia",{"v":2605103,"d":"26.05.1.03"}]
[null,"PE","Dormentes","PE - Dormentes",{"v":2605152,"d":"26.05.1.52"}]
[null,"PE","Escada","PE - Escada",{"v":2605202,"d":"26.05.2.02"}]
[null,"PE","Exu","PE - Exu",{"v":2605301,"d":"26.05.3.01"}]
[null,"PE","Feira Nova","PE - Feira Nova",{"v":2605400,"d":"26.05.4.00"}]
[null,"PE","Fernando de Noronha","PE - Fernando de Noronha",{"v":2605459,"d":"26.05.4.59"}]
[null,"PE","Ferreiros","PE - Ferreiros",{"v":2605509,"d":"26.05.5.09"}]
[null,"PE","Flores","PE - Flores",{"v":2605608,"d":"26.05.6.08"}]
[null,"PE","Floresta","PE - Floresta",{"v":2605707,"d":"26.05.7.07"}]
[null,"PE","Frei Miguelinho","PE - Frei Miguelinho",{"v":2605806,"d":"26.05.8.06"}]
[null,"PE","Gameleira","PE - Gameleira",{"v":2605905,"d":"26.05.9.05"}]
[null,"PE","Garanhuns","PE - Garanhuns",{"v":2606002,"d":"26.06.0.02"}]
[null,"PE","Glória do Goitá","PE - Glória do Goitá",{"v":2606101,"d":"26.06.1.01"}]
[null,"PE","Goiana","PE - Goiana",{"v":2606200,"d":"26.06.2.00"}]
[null,"PE","Granito","PE - Granito",{"v":2606309,"d":"26.06.3.09"}]
[null,"PE","Gravatá","PE - Gravatá",{"v":2606408,"d":"26.06.4.08"}]
[null,"PE","Iati","PE - Iati",{"v":2606507,"d":"26.06.5.07"}]
[null,"PE","Ibimirim","PE - Ibimirim",{"v":2606606,"d":"26.06.6.06"}]
[null,"PE","Ibirajuba","PE - Ibirajuba",{"v":2606705,"d":"26.06.7.05"}]
[null,"PE","Igarassu","PE - Igarassu",{"v":2606804,"d":"26.06.8.04"}]
[null,"PE","Iguaraci","PE - Iguaraci",{"v":2606903,"d":"26.06.9.03"}]
[null,"PE","Ilha de Itamaracá","PE - Ilha de Itamaracá",{"v":2607604,"d":"26.07.6.04"}]
[null,"PE","Inajá","PE - Inajá",{"v":2607000,"d":"26.07.0.00"}]
[null,"PE","Ingazeira","PE - Ingazeira",{"v":2607109,"d":"26.07.1.09"}]
[null,"PE","Ipojuca","PE - Ipojuca",{"v":2607208,"d":"26.07.2.08"}]
[null,"PE","Ipubi","PE - Ipubi",{"v":2607307,"d":"26.07.3.07"}]
[null,"PE","Itacuruba","PE - Itacuruba",{"v":2607406,"d":"26.07.4.06"}]
[null,"PE","Itaíba","PE - Itaíba",{"v":2607505,"d":"26.07.5.05"}]
[null,"PE","Itambé","PE - Itambé",{"v":2607653,"d":"26.07.6.53"}]
[null,"PE","Itapetim","PE - Itapetim",{"v":2607703,"d":"26.07.7.03"}]
[null,"PE","Itapissuma","PE - Itapissuma",{"v":2607752,"d":"26.07.7.52"}]
[null,"PE","Itaquitinga","PE - Itaquitinga",{"v":2607802,"d":"26.07.8.02"}]
[null,"PE","Jaboatão dos Guararapes","PE - Jaboatão dos Guararapes",{"v":2607901,"d":"26.07.9.01"}]
[null,"PE","Jaqueira","PE - Jaqueira",{"v":2607950,"d":"26.07.9.50"}]
[null,"PE","Jataúba","PE - Jataúba",{"v":2608008,"d":"26.08.0.08"}]
[null,"PE","Jatobá","PE - Jatobá",{"v":2608057,"d":"26.08.0.57"}]
[null,"PE","João Alfredo","PE - João Alfredo",{"v":2608107,"d":"26.08.1.07"}]
[null,"PE","Joaquim Nabuco","PE - Joaquim Nabuco",{"v":2608206,"d":"26.08.2.06"}]
[null,"PE","Jucati",{"$f":"CONCATENATE(B2911,\" - \",C2911)","v":"PE - Jucati"},{"v":2608255,"d":"26.08.2.55"}]
[null,"PE","Jupi","PE - Jupi",{"v":2608305,"d":"26.08.3.05"}]
[null,"PE","Jurema","PE - Jurema",{"v":2608404,"d":"26.08.4.04"}]
[null,"PE","Lagoa de Itaenga","PE - Lagoa de Itaenga",{"v":2608503,"d":"26.08.5.03"}]
[null,"PE","Lagoa do Carro","PE - Lagoa do Carro",{"v":2608453,"d":"26.08.4.53"}]
[null,"PE","Lagoa do Ouro","PE - Lagoa do Ouro",{"v":2608602,"d":"26.08.6.02"}]
[null,"PE","Lagoa dos Gatos","PE - Lagoa dos Gatos",{"v":2608701,"d":"26.08.7.01"}]
[null,"PE","Lagoa Grande","PE - Lagoa Grande",{"v":2608750,"d":"26.08.7.50"}]
[null,"PE","Lajedo","PE - Lajedo",{"v":2608800,"d":"26.08.8.00"}]
[null,"PE","Limoeiro","PE - Limoeiro",{"v":2608909,"d":"26.08.9.09"}]
[null,"PE","Macaparana","PE - Macaparana",{"v":2609006,"d":"26.09.0.06"}]
[null,"PE","Machados","PE - Machados",{"v":2609105,"d":"26.09.1.05"}]
[null,"PE","Manari","PE - Manari",{"v":2609154,"d":"26.09.1.54"}]
[null,"PE","Maraial","PE - Maraial",{"v":2609204,"d":"26.09.2.04"}]
[null,"PE","Mirandiba","PE - Mirandiba",{"v":2609303,"d":"26.09.3.03"}]
[null,"PE","Moreilândia","PE - Moreilândia",{"v":2614303,"d":"26.14.3.03"}]
[null,"PE","Moreno","PE - Moreno",{"v":2609402,"d":"26.09.4.02"}]
[null,"PE","Nazaré da Mata","PE - Nazaré da Mata",{"v":2609501,"d":"26.09.5.01"}]
[null,"PE","Olinda","PE - Olinda",{"v":2609600,"d":"26.09.6.00"}]
[null,"PE","Orobó","PE - Orobó",{"v":2609709,"d":"26.09.7.09"}]
[null,"PE","Orocó","PE - Orocó",{"v":2609808,"d":"26.09.8.08"}]
[null,"PE","Ouricuri","PE - Ouricuri",{"v":2609907,"d":"26.09.9.07"}]
[null,"PE","Palmares","PE - Palmares",{"v":2610004,"d":"26.10.0.04"}]
[null,"PE","Palmeirina","PE - Palmeirina",{"v":2610103,"d":"26.10.1.03"}]
[null,"PE","Panelas","PE - Panelas",{"v":2610202,"d":"26.10.2.02"}]
[null,"PE","Paranatama","PE - Paranatama",{"v":2610301,"d":"26.10.3.01"}]
[null,"PE","Parnamirim","PE - Parnamirim",{"v":2610400,"d":"26.10.4.00"}]
[null,"PE","Passira","PE - Passira",{"v":2610509,"d":"26.10.5.09"}]
[null,"PE","Paudalho","PE - Paudalho",{"v":2610608,"d":"26.10.6.08"}]
[null,"PE","Paulista","PE - Paulista",{"v":2610707,"d":"26.10.7.07"}]
[null,"PE","Pedra","PE - Pedra",{"v":2610806,"d":"26.10.8.06"}]
[null,"PE","Pesqueira","PE - Pesqueira",{"v":2610905,"d":"26.10.9.05"}]
[null,"PE","Petrolândia","PE - Petrolândia",{"v":2611002,"d":"26.11.0.02"}]
[null,"PE","Petrolina","PE - Petrolina",{"v":2611101,"d":"26.11.1.01"}]
[null,"PE","Poção","PE - Poção",{"v":2611200,"d":"26.11.2.00"}]
[null,"PE","Pombos","PE - Pombos",{"v":2611309,"d":"26.11.3.09"}]
[null,"PE","Primavera","PE - Primavera",{"v":2611408,"d":"26.11.4.08"}]
[null,"PE","Quipapá","PE - Quipapá",{"v":2611507,"d":"26.11.5.07"}]
[null,"PE","Quixaba","PE - Quixaba",{"v":2611533,"d":"26.11.5.33"}]
[null,"PE","Recife","PE - Recife",{"v":2611606,"d":"26.11.6.06"}]
[null,"PE","Riacho das Almas","PE - Riacho das Almas",{"v":2611705,"d":"26.11.7.05"}]
[null,"PE","Ribeirão","PE - Ribeirão",{"v":2611804,"d":"26.11.8.04"}]
[null,"PE","Rio Formoso","PE - Rio Formoso",{"v":2611903,"d":"26.11.9.03"}]
[null,"PE","Sairé","PE - Sairé",{"v":2612000,"d":"26.12.0.00"}]
[null,"PE","Salgadinho","PE - Salgadinho",{"v":2612109,"d":"26.12.1.09"}]
[null,"PE","Salgueiro","PE - Salgueiro",{"v":2612208,"d":"26.12.2.08"}]
[null,"PE","Saloá","PE - Saloá",{"v":2612307,"d":"26.12.3.07"}]
[null,"PE","Sanharó","PE - Sanharó",{"v":2612406,"d":"26.12.4.06"}]
[null,"PE","Santa Cruz","PE - Santa Cruz",{"v":2612455,"d":"26.12.4.55"}]
[null,"PE","Santa Cruz da Baixa Verde","PE - Santa Cruz da Baixa Verde",{"v":2612471,"d":"26.12.4.71"}]
[null,"PE","Santa Cruz do Capibaribe","PE - Santa Cruz do Capibaribe",{"v":2612505,"d":"26.12.5.05"}]
[null,"PE","Santa Filomena","PE - Santa Filomena",{"v":2612554,"d":"26.12.5.54"}]
[null,"PE","Santa Maria da Boa Vista","PE - Santa Maria da Boa Vista",{"v":2612604,"d":"26.12.6.04"}]
[null,"PE","Santa Maria do Cambucá","PE - Santa Maria do Cambucá",{"v":2612703,"d":"26.12.7.03"}]
[null,"PE","Santa Terezinha","PE - Santa Terezinha",{"v":2612802,"d":"26.12.8.02"}]
[null,"PE","São Benedito do Sul","PE - São Benedito do Sul",{"v":2612901,"d":"26.12.9.01"}]
[null,"PE","São Bento do Una","PE - São Bento do Una",{"v":2613008,"d":"26.13.0.08"}]
[null,"PE","São Caitano","PE - São Caitano",{"v":2613107,"d":"26.13.1.07"}]
[null,"PE","São João","PE - São João",{"v":2613206,"d":"26.13.2.06"}]
[null,"PE","São Joaquim do Monte","PE - São Joaquim do Monte",{"v":2613305,"d":"26.13.3.05"}]
[null,"PE","São José da Coroa Grande","PE - São José da Coroa Grande",{"v":2613404,"d":"26.13.4.04"}]
[null,"PE","São José do Belmonte","PE - São José do Belmonte",{"v":2613503,"d":"26.13.5.03"}]
[null,"PE","São José do Egito","PE - São José do Egito",{"v":2613602,"d":"26.13.6.02"}]
[null,"PE","São Lourenço da Mata","PE - São Lourenço da Mata",{"v":2613701,"d":"26.13.7.01"}]
[null,"PE","São Vicente Ferrer",{"$f":"CONCATENATE(B2975,\" - \",C2975)","v":"PE - São Vicente Ferrer"},{"v":2613800,"d":"26.13.8.00"}]
[null,"PE","Serra Talhada","PE - Serra Talhada",{"v":2613909,"d":"26.13.9.09"}]
[null,"PE","Serrita","PE - Serrita",{"v":2614006,"d":"26.14.0.06"}]
[null,"PE","Sertânia","PE - Sertânia",{"v":2614105,"d":"26.14.1.05"}]
[null,"PE","Sirinhaém","PE - Sirinhaém",{"v":2614204,"d":"26.14.2.04"}]
[null,"PE","Solidão","PE - Solidão",{"v":2614402,"d":"26.14.4.02"}]
[null,"PE","Surubim","PE - Surubim",{"v":2614501,"d":"26.14.5.01"}]
[null,"PE","Tabira","PE - Tabira",{"v":2614600,"d":"26.14.6.00"}]
[null,"PE","Tacaimbó","PE - Tacaimbó",{"v":2614709,"d":"26.14.7.09"}]
[null,"PE","Tacaratu","PE - Tacaratu",{"v":2614808,"d":"26.14.8.08"}]
[null,"PE","Tamandaré","PE - Tamandaré",{"v":2614857,"d":"26.14.8.57"}]
[null,"PE","Taquaritinga do Norte","PE - Taquaritinga do Norte",{"v":2615003,"d":"26.15.0.03"}]
[null,"PE","Terezinha","PE - Terezinha",{"v":2615102,"d":"26.15.1.02"}]
[null,"PE","Terra Nova","PE - Terra Nova",{"v":2615201,"d":"26.15.2.01"}]
[null,"PE","Timbaúba","PE - Timbaúba",{"v":2615300,"d":"26.15.3.00"}]
[null,"PE","Toritama","PE - Toritama",{"v":2615409,"d":"26.15.4.09"}]
[null,"PE","Tracunhaém","PE - Tracunhaém",{"v":2615508,"d":"26.15.5.08"}]
[null,"PE","Trindade","PE - Trindade",{"v":2615607,"d":"26.15.6.07"}]
[null,"PE","Triunfo","PE - Triunfo",{"v":2615706,"d":"26.15.7.06"}]
[null,"PE","Tupanatinga","PE - Tupanatinga",{"v":2615805,"d":"26.15.8.05"}]
[null,"PE","Tuparetama","PE - Tuparetama",{"v":2615904,"d":"26.15.9.04"}]
[null,"PE","Venturosa","PE - Venturosa",{"v":2616001,"d":"26.16.0.01"}]
[null,"PE","Verdejante","PE - Verdejante",{"v":2616100,"d":"26.16.1.00"}]
[null,"PE","Vertente do Lério","PE - Vertente do Lério",{"v":2616183,"d":"26.16.1.83"}]
[null,"PE","Vertentes","PE - Vertentes",{"v":2616209,"d":"26.16.2.09"}]
[null,"PE","Vicência","PE - Vicência",{"v":2616308,"d":"26.16.3.08"}]
[null,"PE","Vitória de Santo Antão","PE - Vitória de Santo Antão",{"v":2616407,"d":"26.16.4.07"}]
[null,"PE","Xexéu","PE - Xexéu",{"v":2616506,"d":"26.16.5.06"}]
[null,"PI","Acauã","PI - Acauã",{"v":2200053,"d":"22.00.0.53"}]
[null,"PI","Agricolândia","PI - Agricolândia",{"v":2200103,"d":"22.00.1.03"}]
[null,"PI","Água Branca","PI - Água Branca",{"v":2200202,"d":"22.00.2.02"}]
[null,"PI","Alagoinha do Piauí","PI - Alagoinha do Piauí",{"v":2200251,"d":"22.00.2.51"}]
[null,"PI","Alegrete do Piauí","PI - Alegrete do Piauí",{"v":2200277,"d":"22.00.2.77"}]
[null,"PI","Alto Longá","PI - Alto Longá",{"v":2200301,"d":"22.00.3.01"}]
[null,"PI","Altos","PI - Altos",{"v":2200400,"d":"22.00.4.00"}]
[null,"PI","Alvorada do Gurguéia","PI - Alvorada do Gurguéia",{"v":2200459,"d":"22.00.4.59"}]
[null,"PI","Amarante","PI - Amarante",{"v":2200509,"d":"22.00.5.09"}]
[null,"PI","Angical do Piauí","PI - Angical do Piauí",{"v":2200608,"d":"22.00.6.08"}]
[null,"PI","Anísio de Abreu","PI - Anísio de Abreu",{"v":2200707,"d":"22.00.7.07"}]
[null,"PI","Antônio Almeida","PI - Antônio Almeida",{"v":2200806,"d":"22.00.8.06"}]
[null,"PI","Aroazes","PI - Aroazes",{"v":2200905,"d":"22.00.9.05"}]
[null,"PI","Aroeiras do Itaim","PI - Aroeiras do Itaim",{"v":2200954,"d":"22.00.9.54"}]
[null,"PI","Arraial","PI - Arraial",{"v":2201002,"d":"22.01.0.02"}]
[null,"PI","Assunção do Piauí","PI - Assunção do Piauí",{"v":2201051,"d":"22.01.0.51"}]
[null,"PI","Avelino Lopes","PI - Avelino Lopes",{"v":2201101,"d":"22.01.1.01"}]
[null,"PI","Baixa Grande do Ribeiro","PI - Baixa Grande do Ribeiro",{"v":2201150,"d":"22.01.1.50"}]
[null,"PI","Barra D'Alcântara","PI - Barra D'Alcântara",{"v":2201176,"d":"22.01.1.76"}]
[null,"PI","Barras","PI - Barras",{"v":2201200,"d":"22.01.2.00"}]
[null,"PI","Barreiras do Piauí","PI - Barreiras do Piauí",{"v":2201309,"d":"22.01.3.09"}]
[null,"PI","Barro Duro","PI - Barro Duro",{"v":2201408,"d":"22.01.4.08"}]
[null,"PI","Batalha","PI - Batalha",{"v":2201507,"d":"22.01.5.07"}]
[null,"PI","Bela Vista do Piauí","PI - Bela Vista do Piauí",{"v":2201556,"d":"22.01.5.56"}]
[null,"PI","Belém do Piauí","PI - Belém do Piauí",{"v":2201572,"d":"22.01.5.72"}]
[null,"PI","Beneditinos","PI - Beneditinos",{"v":2201606,"d":"22.01.6.06"}]
[null,"PI","Bertolínia","PI - Bertolínia",{"v":2201705,"d":"22.01.7.05"}]
[null,"PI","Betânia do Piauí","PI - Betânia do Piauí",{"v":2201739,"d":"22.01.7.39"}]
[null,"PI","Boa Hora","PI - Boa Hora",{"v":2201770,"d":"22.01.7.70"}]
[null,"PI","Bocaina","PI - Bocaina",{"v":2201804,"d":"22.01.8.04"}]
[null,"PI","Bom Jesus","PI - Bom Jesus",{"v":2201903,"d":"22.01.9.03"}]
[null,"PI","Bom Princípio do Piauí","PI - Bom Princípio do Piauí",{"v":2201919,"d":"22.01.9.19"}]
[null,"PI","Bonfim do Piauí","PI - Bonfim do Piauí",{"v":2201929,"d":"22.01.9.29"}]
[null,"PI","Boqueirão do Piauí","PI - Boqueirão do Piauí",{"v":2201945,"d":"22.01.9.45"}]
[null,"PI","Brasileira","PI - Brasileira",{"v":2201960,"d":"22.01.9.60"}]
[null,"PI","Brejo do Piauí","PI - Brejo do Piauí",{"v":2201988,"d":"22.01.9.88"}]
[null,"PI","Buriti dos Lopes",{"$f":"CONCATENATE(B3039,\" - \",C3039)","v":"PI - Buriti dos Lopes"},{"v":2202000,"d":"22.02.0.00"}]
[null,"PI","Buriti dos Montes","PI - Buriti dos Montes",{"v":2202026,"d":"22.02.0.26"}]
[null,"PI","Cabeceiras do Piauí","PI - Cabeceiras do Piauí",{"v":2202059,"d":"22.02.0.59"}]
[null,"PI","Cajazeiras do Piauí","PI - Cajazeiras do Piauí",{"v":2202075,"d":"22.02.0.75"}]
[null,"PI","Cajueiro da Praia","PI - Cajueiro da Praia",{"v":2202083,"d":"22.02.0.83"}]
[null,"PI","Caldeirão Grande do Piauí","PI - Caldeirão Grande do Piauí",{"v":2202091,"d":"22.02.0.91"}]
[null,"PI","Campinas do Piauí","PI - Campinas do Piauí",{"v":2202109,"d":"22.02.1.09"}]
[null,"PI","Campo Alegre do Fidalgo","PI - Campo Alegre do Fidalgo",{"v":2202117,"d":"22.02.1.17"}]
[null,"PI","Campo Grande do Piauí","PI - Campo Grande do Piauí",{"v":2202133,"d":"22.02.1.33"}]
[null,"PI","Campo Largo do Piauí","PI - Campo Largo do Piauí",{"v":2202174,"d":"22.02.1.74"}]
[null,"PI","Campo Maior","PI - Campo Maior",{"v":2202208,"d":"22.02.2.08"}]
[null,"PI","Canavieira","PI - Canavieira",{"v":2202251,"d":"22.02.2.51"}]
[null,"PI","Canto do Buriti","PI - Canto do Buriti",{"v":2202307,"d":"22.02.3.07"}]
[null,"PI","Capitão de Campos","PI - Capitão de Campos",{"v":2202406,"d":"22.02.4.06"}]
[null,"PI","Capitão Gervásio Oliveira","PI - Capitão Gervásio Oliveira",{"v":2202455,"d":"22.02.4.55"}]
[null,"PI","Caracol","PI - Caracol",{"v":2202505,"d":"22.02.5.05"}]
[null,"PI","Caraúbas do Piauí","PI - Caraúbas do Piauí",{"v":2202539,"d":"22.02.5.39"}]
[null,"PI","Caridade do Piauí","PI - Caridade do Piauí",{"v":2202554,"d":"22.02.5.54"}]
[null,"PI","Castelo do Piauí","PI - Castelo do Piauí",{"v":2202604,"d":"22.02.6.04"}]
[null,"PI","Caxingó","PI - Caxingó",{"v":2202653,"d":"22.02.6.53"}]
[null,"PI","Cocal","PI - Cocal",{"v":2202703,"d":"22.02.7.03"}]
[null,"PI","Cocal de Telha","PI - Cocal de Telha",{"v":2202711,"d":"22.02.7.11"}]
[null,"PI","Cocal dos Alves","PI - Cocal dos Alves",{"v":2202729,"d":"22.02.7.29"}]
[null,"PI","Coivaras","PI - Coivaras",{"v":2202737,"d":"22.02.7.37"}]
[null,"PI","Colônia do Gurguéia","PI - Colônia do Gurguéia",{"v":2202752,"d":"22.02.7.52"}]
[null,"PI","Colônia do Piauí","PI - Colônia do Piauí",{"v":2202778,"d":"22.02.7.78"}]
[null,"PI","Conceição do Canindé","PI - Conceição do Canindé",{"v":2202802,"d":"22.02.8.02"}]
[null,"PI","Coronel José Dias","PI - Coronel José Dias",{"v":2202851,"d":"22.02.8.51"}]
[null,"PI","Corrente","PI - Corrente",{"v":2202901,"d":"22.02.9.01"}]
[null,"PI","Cristalândia do Piauí","PI - Cristalândia do Piauí",{"v":2203008,"d":"22.03.0.08"}]
[null,"PI","Cristino Castro","PI - Cristino Castro",{"v":2203107,"d":"22.03.1.07"}]
[null,"PI","Curimatá","PI - Curimatá",{"v":2203206,"d":"22.03.2.06"}]
[null,"PI","Currais","PI - Currais",{"v":2203230,"d":"22.03.2.30"}]
[null,"PI","Curral Novo do Piauí","PI - Curral Novo do Piauí",{"v":2203271,"d":"22.03.2.71"}]
[null,"PI","Curralinhos","PI - Curralinhos",{"v":2203255,"d":"22.03.2.55"}]
[null,"PI","Demerval Lobão","PI - Demerval Lobão",{"v":2203305,"d":"22.03.3.05"}]
[null,"PI","Dirceu Arcoverde","PI - Dirceu Arcoverde",{"v":2203354,"d":"22.03.3.54"}]
[null,"PI","Dom Expedito Lopes","PI - Dom Expedito Lopes",{"v":2203404,"d":"22.03.4.04"}]
[null,"PI","Dom Inocêncio","PI - Dom Inocêncio",{"v":2203453,"d":"22.03.4.53"}]
[null,"PI","Domingos Mourão","PI - Domingos Mourão",{"v":2203420,"d":"22.03.4.20"}]
[null,"PI","Elesbão Veloso","PI - Elesbão Veloso",{"v":2203503,"d":"22.03.5.03"}]
[null,"PI","Eliseu Martins","PI - Eliseu Martins",{"v":2203602,"d":"22.03.6.02"}]
[null,"PI","Esperantina","PI - Esperantina",{"v":2203701,"d":"22.03.7.01"}]
[null,"PI","Fartura do Piauí","PI - Fartura do Piauí",{"v":2203750,"d":"22.03.7.50"}]
[null,"PI","Flores do Piauí","PI - Flores do Piauí",{"v":2203800,"d":"22.03.8.00"}]
[null,"PI","Floresta do Piauí","PI - Floresta do Piauí",{"v":2203859,"d":"22.03.8.59"}]
[null,"PI","Floriano","PI - Floriano",{"v":2203909,"d":"22.03.9.09"}]
[null,"PI","Francinópolis","PI - Francinópolis",{"v":2204006,"d":"22.04.0.06"}]
[null,"PI","Francisco Ayres","PI - Francisco Ayres",{"v":2204105,"d":"22.04.1.05"}]
[null,"PI","Francisco Macedo","PI - Francisco Macedo",{"v":2204154,"d":"22.04.1.54"}]
[null,"PI","Francisco Santos","PI - Francisco Santos",{"v":2204204,"d":"22.04.2.04"}]
[null,"PI","Fronteiras","PI - Fronteiras",{"v":2204303,"d":"22.04.3.03"}]
[null,"PI","Geminiano","PI - Geminiano",{"v":2204352,"d":"22.04.3.52"}]
[null,"PI","Gilbués","PI - Gilbués",{"v":2204402,"d":"22.04.4.02"}]
[null,"PI","Guadalupe","PI - Guadalupe",{"v":2204501,"d":"22.04.5.01"}]
[null,"PI","Guaribas","PI - Guaribas",{"v":2204550,"d":"22.04.5.50"}]
[null,"PI","Hugo Napoleão","PI - Hugo Napoleão",{"v":2204600,"d":"22.04.6.00"}]
[null,"PI","Ilha Grande","PI - Ilha Grande",{"v":2204659,"d":"22.04.6.59"}]
[null,"PI","Inhuma","PI - Inhuma",{"v":2204709,"d":"22.04.7.09"}]
[null,"PI","Ipiranga do Piauí","PI - Ipiranga do Piauí",{"v":2204808,"d":"22.04.8.08"}]
[null,"PI","Isaías Coelho","PI - Isaías Coelho",{"v":2204907,"d":"22.04.9.07"}]
[null,"PI","Itainópolis","PI - Itainópolis",{"v":2205003,"d":"22.05.0.03"}]
[null,"PI","Itaueira","PI - Itaueira",{"v":2205102,"d":"22.05.1.02"}]
[null,"PI","Jacobina do Piauí","PI - Jacobina do Piauí",{"v":2205151,"d":"22.05.1.51"}]
[null,"PI","Jaicós",{"$f":"CONCATENATE(B3103,\" - \",C3103)","v":"PI - Jaicós"},{"v":2205201,"d":"22.05.2.01"}]
[null,"PI","Jardim do Mulato","PI - Jardim do Mulato",{"v":2205250,"d":"22.05.2.50"}]
[null,"PI","Jatobá do Piauí","PI - Jatobá do Piauí",{"v":2205276,"d":"22.05.2.76"}]
[null,"PI","Jerumenha","PI - Jerumenha",{"v":2205300,"d":"22.05.3.00"}]
[null,"PI","João Costa","PI - João Costa",{"v":2205359,"d":"22.05.3.59"}]
[null,"PI","Joaquim Pires","PI - Joaquim Pires",{"v":2205409,"d":"22.05.4.09"}]
[null,"PI","Joca Marques","PI - Joca Marques",{"v":2205458,"d":"22.05.4.58"}]
[null,"PI","José de Freitas","PI - José de Freitas",{"v":2205508,"d":"22.05.5.08"}]
[null,"PI","Juazeiro do Piauí","PI - Juazeiro do Piauí",{"v":2205516,"d":"22.05.5.16"}]
[null,"PI","Júlio Borges","PI - Júlio Borges",{"v":2205524,"d":"22.05.5.24"}]
[null,"PI","Jurema","PI - Jurema",{"v":2205532,"d":"22.05.5.32"}]
[null,"PI","Lagoa Alegre","PI - Lagoa Alegre",{"v":2205557,"d":"22.05.5.57"}]
[null,"PI","Lagoa de São Francisco","PI - Lagoa de São Francisco",{"v":2205573,"d":"22.05.5.73"}]
[null,"PI","Lagoa do Barro do Piauí","PI - Lagoa do Barro do Piauí",{"v":2205565,"d":"22.05.5.65"}]
[null,"PI","Lagoa do Piauí","PI - Lagoa do Piauí",{"v":2205581,"d":"22.05.5.81"}]
[null,"PI","Lagoa do Sítio","PI - Lagoa do Sítio",{"v":2205599,"d":"22.05.5.99"}]
[null,"PI","Lagoinha do Piauí","PI - Lagoinha do Piauí",{"v":2205540,"d":"22.05.5.40"}]
[null,"PI","Landri Sales","PI - Landri Sales",{"v":2205607,"d":"22.05.6.07"}]
[null,"PI","Luís Correia","PI - Luís Correia",{"v":2205706,"d":"22.05.7.06"}]
[null,"PI","Luzilândia","PI - Luzilândia",{"v":2205805,"d":"22.05.8.05"}]
[null,"PI","Madeiro","PI - Madeiro",{"v":2205854,"d":"22.05.8.54"}]
[null,"PI","Manoel Emídio","PI - Manoel Emídio",{"v":2205904,"d":"22.05.9.04"}]
[null,"PI","Marcolândia","PI - Marcolândia",{"v":2205953,"d":"22.05.9.53"}]
[null,"PI","Marcos Parente","PI - Marcos Parente",{"v":2206001,"d":"22.06.0.01"}]
[null,"PI","Massapê do Piauí","PI - Massapê do Piauí",{"v":2206050,"d":"22.06.0.50"}]
[null,"PI","Matias Olímpio","PI - Matias Olímpio",{"v":2206100,"d":"22.06.1.00"}]
[null,"PI","Miguel Alves","PI - Miguel Alves",{"v":2206209,"d":"22.06.2.09"}]
[null,"PI","Miguel Leão","PI - Miguel Leão",{"v":2206308,"d":"22.06.3.08"}]
[null,"PI","Milton Brandão","PI - Milton Brandão",{"v":2206357,"d":"22.06.3.57"}]
[null,"PI","Monsenhor Gil","PI - Monsenhor Gil",{"v":2206407,"d":"22.06.4.07"}]
[null,"PI","Monsenhor Hipólito","PI - Monsenhor Hipólito",{"v":2206506,"d":"22.06.5.06"}]
[null,"PI","Monte Alegre do Piauí","PI - Monte Alegre do Piauí",{"v":2206605,"d":"22.06.6.05"}]
[null,"PI","Morro Cabeça no Tempo","PI - Morro Cabeça no Tempo",{"v":2206654,"d":"22.06.6.54"}]
[null,"PI","Morro do Chapéu do Piauí","PI - Morro do Chapéu do Piauí",{"v":2206670,"d":"22.06.6.70"}]
[null,"PI","Murici dos Portelas","PI - Murici dos Portelas",{"v":2206696,"d":"22.06.6.96"}]
[null,"PI","Nazaré do Piauí","PI - Nazaré do Piauí",{"v":2206704,"d":"22.06.7.04"}]
[null,"PI","Nazária ","PI - Nazária ",{"v":2206720,"d":"22.06.7.20"}]
[null,"PI","Nossa Senhora de Nazaré","PI - Nossa Senhora de Nazaré",{"v":2206753,"d":"22.06.7.53"}]
[null,"PI","Nossa Senhora dos Remédios","PI - Nossa Senhora dos Remédios",{"v":2206803,"d":"22.06.8.03"}]
[null,"PI","Nova Santa Rita","PI - Nova Santa Rita",{"v":2207959,"d":"22.07.9.59"}]
[null,"PI","Novo Oriente do Piauí","PI - Novo Oriente do Piauí",{"v":2206902,"d":"22.06.9.02"}]
[null,"PI","Novo Santo Antônio","PI - Novo Santo Antônio",{"v":2206951,"d":"22.06.9.51"}]
[null,"PI","Oeiras","PI - Oeiras",{"v":2207009,"d":"22.07.0.09"}]
[null,"PI","Olho D'Água do Piauí","PI - Olho D'Água do Piauí",{"v":2207108,"d":"22.07.1.08"}]
[null,"PI","Padre Marcos","PI - Padre Marcos",{"v":2207207,"d":"22.07.2.07"}]
[null,"PI","Paes Landim","PI - Paes Landim",{"v":2207306,"d":"22.07.3.06"}]
[null,"PI","Pajeú do Piauí","PI - Pajeú do Piauí",{"v":2207355,"d":"22.07.3.55"}]
[null,"PI","Palmeira do Piauí","PI - Palmeira do Piauí",{"v":2207405,"d":"22.07.4.05"}]
[null,"PI","Palmeirais","PI - Palmeirais",{"v":2207504,"d":"22.07.5.04"}]
[null,"PI","Paquetá","PI - Paquetá",{"v":2207553,"d":"22.07.5.53"}]
[null,"PI","Parnaguá","PI - Parnaguá",{"v":2207603,"d":"22.07.6.03"}]
[null,"PI","Parnaíba","PI - Parnaíba",{"v":2207702,"d":"22.07.7.02"}]
[null,"PI","Passagem Franca do Piauí","PI - Passagem Franca do Piauí",{"v":2207751,"d":"22.07.7.51"}]
[null,"PI","Patos do Piauí","PI - Patos do Piauí",{"v":2207777,"d":"22.07.7.77"}]
[null,"PI","Pau D'Arco do Piauí","PI - Pau D'Arco do Piauí",{"v":2207793,"d":"22.07.7.93"}]
[null,"PI","Paulistana","PI - Paulistana",{"v":2207801,"d":"22.07.8.01"}]
[null,"PI","Pavussu","PI - Pavussu",{"v":2207850,"d":"22.07.8.50"}]
[null,"PI","Pedro II","PI - Pedro II",{"v":2207900,"d":"22.07.9.00"}]
[null,"PI","Pedro Laurentino","PI - Pedro Laurentino",{"v":2207934,"d":"22.07.9.34"}]
[null,"PI","Picos","PI - Picos",{"v":2208007,"d":"22.08.0.07"}]
[null,"PI","Pimenteiras","PI - Pimenteiras",{"v":2208106,"d":"22.08.1.06"}]
[null,"PI","Pio IX","PI - Pio IX",{"v":2208205,"d":"22.08.2.05"}]
[null,"PI","Piracuruca","PI - Piracuruca",{"v":2208304,"d":"22.08.3.04"}]
[null,"PI","Piripiri","PI - Piripiri",{"v":2208403,"d":"22.08.4.03"}]
[null,"PI","Porto",{"$f":"CONCATENATE(B3167,\" - \",C3167)","v":"PI - Porto"},{"v":2208502,"d":"22.08.5.02"}]
[null,"PI","Porto Alegre do Piauí","PI - Porto Alegre do Piauí",{"v":2208551,"d":"22.08.5.51"}]
[null,"PI","Prata do Piauí","PI - Prata do Piauí",{"v":2208601,"d":"22.08.6.01"}]
[null,"PI","Queimada Nova","PI - Queimada Nova",{"v":2208650,"d":"22.08.6.50"}]
[null,"PI","Redenção do Gurguéia","PI - Redenção do Gurguéia",{"v":2208700,"d":"22.08.7.00"}]
[null,"PI","Regeneração","PI - Regeneração",{"v":2208809,"d":"22.08.8.09"}]
[null,"PI","Riacho Frio","PI - Riacho Frio",{"v":2208858,"d":"22.08.8.58"}]
[null,"PI","Ribeira do Piauí","PI - Ribeira do Piauí",{"v":2208874,"d":"22.08.8.74"}]
[null,"PI","Ribeiro Gonçalves","PI - Ribeiro Gonçalves",{"v":2208908,"d":"22.08.9.08"}]
[null,"PI","Rio Grande do Piauí","PI - Rio Grande do Piauí",{"v":2209005,"d":"22.09.0.05"}]
[null,"PI","Santa Cruz do Piauí","PI - Santa Cruz do Piauí",{"v":2209104,"d":"22.09.1.04"}]
[null,"PI","Santa Cruz dos Milagres","PI - Santa Cruz dos Milagres",{"v":2209153,"d":"22.09.1.53"}]
[null,"PI","Santa Filomena","PI - Santa Filomena",{"v":2209203,"d":"22.09.2.03"}]
[null,"PI","Santa Luz","PI - Santa Luz",{"v":2209302,"d":"22.09.3.02"}]
[null,"PI","Santa Rosa do Piauí","PI - Santa Rosa do Piauí",{"v":2209377,"d":"22.09.3.77"}]
[null,"PI","Santana do Piauí","PI - Santana do Piauí",{"v":2209351,"d":"22.09.3.51"}]
[null,"PI","Santo Antônio de Lisboa","PI - Santo Antônio de Lisboa",{"v":2209401,"d":"22.09.4.01"}]
[null,"PI","Santo Antônio dos Milagres","PI - Santo Antônio dos Milagres",{"v":2209450,"d":"22.09.4.50"}]
[null,"PI","Santo Inácio do Piauí","PI - Santo Inácio do Piauí",{"v":2209500,"d":"22.09.5.00"}]
[null,"PI","São Braz do Piauí","PI - São Braz do Piauí",{"v":2209559,"d":"22.09.5.59"}]
[null,"PI","São Félix do Piauí","PI - São Félix do Piauí",{"v":2209609,"d":"22.09.6.09"}]
[null,"PI","São Francisco de Assis do Piauí","PI - São Francisco de Assis do Piauí",{"v":2209658,"d":"22.09.6.58"}]
[null,"PI","São Francisco do Piauí","PI - São Francisco do Piauí",{"v":2209708,"d":"22.09.7.08"}]
[null,"PI","São Gonçalo do Gurguéia","PI - São Gonçalo do Gurguéia",{"v":2209757,"d":"22.09.7.57"}]
[null,"PI","São Gonçalo do Piauí","PI - São Gonçalo do Piauí",{"v":2209807,"d":"22.09.8.07"}]
[null,"PI","São João da Canabrava","PI - São João da Canabrava",{"v":2209856,"d":"22.09.8.56"}]
[null,"PI","São João da Fronteira","PI - São João da Fronteira",{"v":2209872,"d":"22.09.8.72"}]
[null,"PI","São João da Serra","PI - São João da Serra",{"v":2209906,"d":"22.09.9.06"}]
[null,"PI","São João da Varjota","PI - São João da Varjota",{"v":2209955,"d":"22.09.9.55"}]
[null,"PI","São João do Arraial","PI - São João do Arraial",{"v":2209971,"d":"22.09.9.71"}]
[null,"PI","São João do Piauí","PI - São João do Piauí",{"v":2210003,"d":"22.10.0.03"}]
[null,"PI","São José do Divino","PI - São José do Divino",{"v":2210052,"d":"22.10.0.52"}]
[null,"PI","São José do Peixe","PI - São José do Peixe",{"v":2210102,"d":"22.10.1.02"}]
[null,"PI","São José do Piauí","PI - São José do Piauí",{"v":2210201,"d":"22.10.2.01"}]
[null,"PI","São Julião","PI - São Julião",{"v":2210300,"d":"22.10.3.00"}]
[null,"PI","São Lourenço do Piauí","PI - São Lourenço do Piauí",{"v":2210359,"d":"22.10.3.59"}]
[null,"PI","São Luis do Piauí","PI - São Luis do Piauí",{"v":2210375,"d":"22.10.3.75"}]
[null,"PI","São Miguel da Baixa Grande","PI - São Miguel da Baixa Grande",{"v":2210383,"d":"22.10.3.83"}]
[null,"PI","São Miguel do Fidalgo","PI - São Miguel do Fidalgo",{"v":2210391,"d":"22.10.3.91"}]
[null,"PI","São Miguel do Tapuio","PI - São Miguel do Tapuio",{"v":2210409,"d":"22.10.4.09"}]
[null,"PI","São Pedro do Piauí","PI - São Pedro do Piauí",{"v":2210508,"d":"22.10.5.08"}]
[null,"PI","São Raimundo Nonato","PI - São Raimundo Nonato",{"v":2210607,"d":"22.10.6.07"}]
[null,"PI","Sebastião Barros","PI - Sebastião Barros",{"v":2210623,"d":"22.10.6.23"}]
[null,"PI","Sebastião Leal","PI - Sebastião Leal",{"v":2210631,"d":"22.10.6.31"}]
[null,"PI","Sigefredo Pacheco","PI - Sigefredo Pacheco",{"v":2210656,"d":"22.10.6.56"}]
[null,"PI","Simões","PI - Simões",{"v":2210706,"d":"22.10.7.06"}]
[null,"PI","Simplício Mendes","PI - Simplício Mendes",{"v":2210805,"d":"22.10.8.05"}]
[null,"PI","Socorro do Piauí","PI - Socorro do Piauí",{"v":2210904,"d":"22.10.9.04"}]
[null,"PI","Sussuapara","PI - Sussuapara",{"v":2210938,"d":"22.10.9.38"}]
[null,"PI","Tamboril do Piauí","PI - Tamboril do Piauí",{"v":2210953,"d":"22.10.9.53"}]
[null,"PI","Tanque do Piauí","PI - Tanque do Piauí",{"v":2210979,"d":"22.10.9.79"}]
[null,"PI","Teresina","PI - Teresina",{"v":2211001,"d":"22.11.0.01"}]
[null,"PI","União","PI - União",{"v":2211100,"d":"22.11.1.00"}]
[null,"PI","Uruçuí","PI - Uruçuí",{"v":2211209,"d":"22.11.2.09"}]
[null,"PI","Valença do Piauí","PI - Valença do Piauí",{"v":2211308,"d":"22.11.3.08"}]
[null,"PI","Várzea Branca","PI - Várzea Branca",{"v":2211357,"d":"22.11.3.57"}]
[null,"PI","Várzea Grande","PI - Várzea Grande",{"v":2211407,"d":"22.11.4.07"}]
[null,"PI","Vera Mendes","PI - Vera Mendes",{"v":2211506,"d":"22.11.5.06"}]
[null,"PI","Vila Nova do Piauí","PI - Vila Nova do Piauí",{"v":2211605,"d":"22.11.6.05"}]
[null,"PI","Wall Ferraz","PI - Wall Ferraz",{"v":2211704,"d":"22.11.7.04"}]
[null,"PR","Abatiá","PR - Abatiá",{"v":4100103,"d":"41.00.1.03"}]
[null,"PR","Adrianópolis","PR - Adrianópolis",{"v":4100202,"d":"41.00.2.02"}]
[null,"PR","Agudos do Sul","PR - Agudos do Sul",{"v":4100301,"d":"41.00.3.01"}]
[null,"PR","Almirante Tamandaré","PR - Almirante Tamandaré",{"v":4100400,"d":"41.00.4.00"}]
[null,"PR","Altamira do Paraná",{"$f":"CONCATENATE(B3231,\" - \",C3231)","v":"PR - Altamira do Paraná"},{"v":4100459,"d":"41.00.4.59"}]
[null,"PR","Alto Paraíso","PR - Alto Paraíso",{"v":4128625,"d":"41.28.6.25"}]
[null,"PR","Alto Paraná","PR - Alto Paraná",{"v":4100608,"d":"41.00.6.08"}]
[null,"PR","Alto Piquiri","PR - Alto Piquiri",{"v":4100707,"d":"41.00.7.07"}]
[null,"PR","Altônia","PR - Altônia",{"v":4100509,"d":"41.00.5.09"}]
[null,"PR","Alvorada do Sul","PR - Alvorada do Sul",{"v":4100806,"d":"41.00.8.06"}]
[null,"PR","Amaporã","PR - Amaporã",{"v":4100905,"d":"41.00.9.05"}]
[null,"PR","Ampére","PR - Ampére",{"v":4101002,"d":"41.01.0.02"}]
[null,"PR","Anahy","PR - Anahy",{"v":4101051,"d":"41.01.0.51"}]
[null,"PR","Andirá","PR - Andirá",{"v":4101101,"d":"41.01.1.01"}]
[null,"PR","Ângulo","PR - Ângulo",{"v":4101150,"d":"41.01.1.50"}]
[null,"PR","Antonina","PR - Antonina",{"v":4101200,"d":"41.01.2.00"}]
[null,"PR","Antônio Olinto","PR - Antônio Olinto",{"v":4101309,"d":"41.01.3.09"}]
[null,"PR","Apucarana","PR - Apucarana",{"v":4101408,"d":"41.01.4.08"}]
[null,"PR","Arapongas","PR - Arapongas",{"v":4101507,"d":"41.01.5.07"}]
[null,"PR","Arapoti","PR - Arapoti",{"v":4101606,"d":"41.01.6.06"}]
[null,"PR","Arapuã","PR - Arapuã",{"v":4101655,"d":"41.01.6.55"}]
[null,"PR","Araruna","PR - Araruna",{"v":4101705,"d":"41.01.7.05"}]
[null,"PR","Araucária","PR - Araucária",{"v":4101804,"d":"41.01.8.04"}]
[null,"PR","Ariranha do Ivaí","PR - Ariranha do Ivaí",{"v":4101853,"d":"41.01.8.53"}]
[null,"PR","Assaí","PR - Assaí",{"v":4101903,"d":"41.01.9.03"}]
[null,"PR","Assis Chateaubriand","PR - Assis Chateaubriand",{"v":4102000,"d":"41.02.0.00"}]
[null,"PR","Astorga","PR - Astorga",{"v":4102109,"d":"41.02.1.09"}]
[null,"PR","Atalaia","PR - Atalaia",{"v":4102208,"d":"41.02.2.08"}]
[null,"PR","Balsa Nova","PR - Balsa Nova",{"v":4102307,"d":"41.02.3.07"}]
[null,"PR","Bandeirantes","PR - Bandeirantes",{"v":4102406,"d":"41.02.4.06"}]
[null,"PR","Barbosa Ferraz","PR - Barbosa Ferraz",{"v":4102505,"d":"41.02.5.05"}]
[null,"PR","Barra do Jacaré","PR - Barra do Jacaré",{"v":4102703,"d":"41.02.7.03"}]
[null,"PR","Barracão","PR - Barracão",{"v":4102604,"d":"41.02.6.04"}]
[null,"PR","Bela Vista da Caroba","PR - Bela Vista da Caroba",{"v":4102752,"d":"41.02.7.52"}]
[null,"PR","Bela Vista do Paraíso","PR - Bela Vista do Paraíso",{"v":4102802,"d":"41.02.8.02"}]
[null,"PR","Bituruna","PR - Bituruna",{"v":4102901,"d":"41.02.9.01"}]
[null,"PR","Boa Esperança","PR - Boa Esperança",{"v":4103008,"d":"41.03.0.08"}]
[null,"PR","Boa Esperança do Iguaçu","PR - Boa Esperança do Iguaçu",{"v":4103024,"d":"41.03.0.24"}]
[null,"PR","Boa Ventura de São Roque","PR - Boa Ventura de São Roque",{"v":4103040,"d":"41.03.0.40"}]
[null,"PR","Boa Vista da Aparecida","PR - Boa Vista da Aparecida",{"v":4103057,"d":"41.03.0.57"}]
[null,"PR","Bocaiúva do Sul","PR - Bocaiúva do Sul",{"v":4103107,"d":"41.03.1.07"}]
[null,"PR","Bom Jesus do Sul","PR - Bom Jesus do Sul",{"v":4103156,"d":"41.03.1.56"}]
[null,"PR","Bom Sucesso","PR - Bom Sucesso",{"v":4103206,"d":"41.03.2.06"}]
[null,"PR","Bom Sucesso do Sul","PR - Bom Sucesso do Sul",{"v":4103222,"d":"41.03.2.22"}]
[null,"PR","Borrazópolis","PR - Borrazópolis",{"v":4103305,"d":"41.03.3.05"}]
[null,"PR","Braganey","PR - Braganey",{"v":4103354,"d":"41.03.3.54"}]
[null,"PR","Brasilândia do Sul","PR - Brasilândia do Sul",{"v":4103370,"d":"41.03.3.70"}]
[null,"PR","Cafeara","PR - Cafeara",{"v":4103404,"d":"41.03.4.04"}]
[null,"PR","Cafelândia","PR - Cafelândia",{"v":4103453,"d":"41.03.4.53"}]
[null,"PR","Cafezal do Sul","PR - Cafezal do Sul",{"v":4103479,"d":"41.03.4.79"}]
[null,"PR","Califórnia","PR - Califórnia",{"v":4103503,"d":"41.03.5.03"}]
[null,"PR","Cambará","PR - Cambará",{"v":4103602,"d":"41.03.6.02"}]
[null,"PR","Cambé","PR - Cambé",{"v":4103701,"d":"41.03.7.01"}]
[null,"PR","Cambira","PR - Cambira",{"v":4103800,"d":"41.03.8.00"}]
[null,"PR","Campina da Lagoa","PR - Campina da Lagoa",{"v":4103909,"d":"41.03.9.09"}]
[null,"PR","Campina do Simão","PR - Campina do Simão",{"v":4103958,"d":"41.03.9.58"}]
[null,"PR","Campina Grande do Sul","PR - Campina Grande do Sul",{"v":4104006,"d":"41.04.0.06"}]
[null,"PR","Campo Bonito","PR - Campo Bonito",{"v":4104055,"d":"41.04.0.55"}]
[null,"PR","Campo do Tenente","PR - Campo do Tenente",{"v":4104105,"d":"41.04.1.05"}]
[null,"PR","Campo Largo","PR - Campo Largo",{"v":4104204,"d":"41.04.2.04"}]
[null,"PR","Campo Magro","PR - Campo Magro",{"v":4104253,"d":"41.04.2.53"}]
[null,"PR","Campo Mourão","PR - Campo Mourão",{"v":4104303,"d":"41.04.3.03"}]
[null,"PR","Cândido de Abreu","PR - Cândido de Abreu",{"v":4104402,"d":"41.04.4.02"}]
[null,"PR","Candói","PR - Candói",{"v":4104428,"d":"41.04.4.28"}]
[null,"PR","Cantagalo","PR - Cantagalo",{"v":4104451,"d":"41.04.4.51"}]
[null,"PR","Capanema","PR - Capanema",{"v":4104501,"d":"41.04.5.01"}]
[null,"PR","Capitão Leônidas Marques","PR - Capitão Leônidas Marques",{"v":4104600,"d":"41.04.6.00"}]
[null,"PR","Carambeí","PR - Carambeí",{"v":4104659,"d":"41.04.6.59"}]
[null,"PR","Carlópolis",{"$f":"CONCATENATE(B3295,\" - \",C3295)","v":"PR - Carlópolis"},{"v":4104709,"d":"41.04.7.09"}]
[null,"PR","Cascavel","PR - Cascavel",{"v":4104808,"d":"41.04.8.08"}]
[null,"PR","Castro","PR - Castro",{"v":4104907,"d":"41.04.9.07"}]
[null,"PR","Catanduvas","PR - Catanduvas",{"v":4105003,"d":"41.05.0.03"}]
[null,"PR","Centenário do Sul","PR - Centenário do Sul",{"v":4105102,"d":"41.05.1.02"}]
[null,"PR","Cerro Azul","PR - Cerro Azul",{"v":4105201,"d":"41.05.2.01"}]
[null,"PR","Céu Azul","PR - Céu Azul",{"v":4105300,"d":"41.05.3.00"}]
[null,"PR","Chopinzinho","PR - Chopinzinho",{"v":4105409,"d":"41.05.4.09"}]
[null,"PR","Cianorte","PR - Cianorte",{"v":4105508,"d":"41.05.5.08"}]
[null,"PR","Cidade Gaúcha","PR - Cidade Gaúcha",{"v":4105607,"d":"41.05.6.07"}]
[null,"PR","Clevelândia","PR - Clevelândia",{"v":4105706,"d":"41.05.7.06"}]
[null,"PR","Colombo","PR - Colombo",{"v":4105805,"d":"41.05.8.05"}]
[null,"PR","Colorado","PR - Colorado",{"v":4105904,"d":"41.05.9.04"}]
[null,"PR","Congonhinhas","PR - Congonhinhas",{"v":4106001,"d":"41.06.0.01"}]
[null,"PR","Conselheiro Mairinck","PR - Conselheiro Mairinck",{"v":4106100,"d":"41.06.1.00"}]
[null,"PR","Contenda","PR - Contenda",{"v":4106209,"d":"41.06.2.09"}]
[null,"PR","Corbélia","PR - Corbélia",{"v":4106308,"d":"41.06.3.08"}]
[null,"PR","Cornélio Procópio","PR - Cornélio Procópio",{"v":4106407,"d":"41.06.4.07"}]
[null,"PR","Coronel Domingos Soares","PR - Coronel Domingos Soares",{"v":4106456,"d":"41.06.4.56"}]
[null,"PR","Coronel Vivida","PR - Coronel Vivida",{"v":4106506,"d":"41.06.5.06"}]
[null,"PR","Corumbataí do Sul","PR - Corumbataí do Sul",{"v":4106555,"d":"41.06.5.55"}]
[null,"PR","Cruz Machado","PR - Cruz Machado",{"v":4106803,"d":"41.06.8.03"}]
[null,"PR","Cruzeiro do Iguaçu","PR - Cruzeiro do Iguaçu",{"v":4106571,"d":"41.06.5.71"}]
[null,"PR","Cruzeiro do Oeste","PR - Cruzeiro do Oeste",{"v":4106605,"d":"41.06.6.05"}]
[null,"PR","Cruzeiro do Sul","PR - Cruzeiro do Sul",{"v":4106704,"d":"41.06.7.04"}]
[null,"PR","Cruzmaltina","PR - Cruzmaltina",{"v":4106852,"d":"41.06.8.52"}]
[null,"PR","Curitiba","PR - Curitiba",{"v":4106902,"d":"41.06.9.02"}]
[null,"PR","Curiúva","PR - Curiúva",{"v":4107009,"d":"41.07.0.09"}]
[null,"PR","Diamante do Norte","PR - Diamante do Norte",{"v":4107108,"d":"41.07.1.08"}]
[null,"PR","Diamante do Sul","PR - Diamante do Sul",{"v":4107124,"d":"41.07.1.24"}]
[null,"PR","Diamante D'Oeste","PR - Diamante D'Oeste",{"v":4107157,"d":"41.07.1.57"}]
[null,"PR","Dois Vizinhos","PR - Dois Vizinhos",{"v":4107207,"d":"41.07.2.07"}]
[null,"PR","Douradina","PR - Douradina",{"v":4107256,"d":"41.07.2.56"}]
[null,"PR","Doutor Camargo","PR - Doutor Camargo",{"v":4107306,"d":"41.07.3.06"}]
[null,"PR","Doutor Ulysses","PR - Doutor Ulysses",{"v":4128633,"d":"41.28.6.33"}]
[null,"PR","Enéas Marques","PR - Enéas Marques",{"v":4107405,"d":"41.07.4.05"}]
[null,"PR","Engenheiro Beltrão","PR - Engenheiro Beltrão",{"v":4107504,"d":"41.07.5.04"}]
[null,"PR","Entre Rios do Oeste","PR - Entre Rios do Oeste",{"v":4107538,"d":"41.07.5.38"}]
[null,"PR","Esperança Nova","PR - Esperança Nova",{"v":4107520,"d":"41.07.5.20"}]
[null,"PR","Espigão Alto do Iguaçu","PR - Espigão Alto do Iguaçu",{"v":4107546,"d":"41.07.5.46"}]
[null,"PR","Farol","PR - Farol",{"v":4107553,"d":"41.07.5.53"}]
[null,"PR","Faxinal","PR - Faxinal",{"v":4107603,"d":"41.07.6.03"}]
[null,"PR","Fazenda Rio Grande","PR - Fazenda Rio Grande",{"v":4107652,"d":"41.07.6.52"}]
[null,"PR","Fênix","PR - Fênix",{"v":4107702,"d":"41.07.7.02"}]
[null,"PR","Fernandes Pinheiro","PR - Fernandes Pinheiro",{"v":4107736,"d":"41.07.7.36"}]
[null,"PR","Figueira","PR - Figueira",{"v":4107751,"d":"41.07.7.51"}]
[null,"PR","Flor da Serra do Sul","PR - Flor da Serra do Sul",{"v":4107850,"d":"41.07.8.50"}]
[null,"PR","Floraí","PR - Floraí",{"v":4107801,"d":"41.07.8.01"}]
[null,"PR","Floresta","PR - Floresta",{"v":4107900,"d":"41.07.9.00"}]
[null,"PR","Florestópolis","PR - Florestópolis",{"v":4108007,"d":"41.08.0.07"}]
[null,"PR","Flórida","PR - Flórida",{"v":4108106,"d":"41.08.1.06"}]
[null,"PR","Formosa do Oeste","PR - Formosa do Oeste",{"v":4108205,"d":"41.08.2.05"}]
[null,"PR","Foz do Iguaçu","PR - Foz do Iguaçu",{"v":4108304,"d":"41.08.3.04"}]
[null,"PR","Foz do Jordão","PR - Foz do Jordão",{"v":4108452,"d":"41.08.4.52"}]
[null,"PR","Francisco Alves","PR - Francisco Alves",{"v":4108320,"d":"41.08.3.20"}]
[null,"PR","Francisco Beltrão","PR - Francisco Beltrão",{"v":4108403,"d":"41.08.4.03"}]
[null,"PR","General Carneiro","PR - General Carneiro",{"v":4108502,"d":"41.08.5.02"}]
[null,"PR","Godoy Moreira","PR - Godoy Moreira",{"v":4108551,"d":"41.08.5.51"}]
[null,"PR","Goioerê","PR - Goioerê",{"v":4108601,"d":"41.08.6.01"}]
[null,"PR","Goioxim","PR - Goioxim",{"v":4108650,"d":"41.08.6.50"}]
[null,"PR","Grandes Rios","PR - Grandes Rios",{"v":4108700,"d":"41.08.7.00"}]
[null,"PR","Guaíra","PR - Guaíra",{"v":4108809,"d":"41.08.8.09"}]
[null,"PR","Guairaçá","PR - Guairaçá",{"v":4108908,"d":"41.08.9.08"}]
[null,"PR","Guamiranga","PR - Guamiranga",{"v":4108957,"d":"41.08.9.57"}]
[null,"PR","Guapirama",{"$f":"CONCATENATE(B3359,\" - \",C3359)","v":"PR - Guapirama"},{"v":4109005,"d":"41.09.0.05"}]
[null,"PR","Guaporema","PR - Guaporema",{"v":4109104,"d":"41.09.1.04"}]
[null,"PR","Guaraci","PR - Guaraci",{"v":4109203,"d":"41.09.2.03"}]
[null,"PR","Guaraniaçu","PR - Guaraniaçu",{"v":4109302,"d":"41.09.3.02"}]
[null,"PR","Guarapuava","PR - Guarapuava",{"v":4109401,"d":"41.09.4.01"}]
[null,"PR","Guaraqueçaba","PR - Guaraqueçaba",{"v":4109500,"d":"41.09.5.00"}]
[null,"PR","Guaratuba","PR - Guaratuba",{"v":4109609,"d":"41.09.6.09"}]
[null,"PR","Honório Serpa","PR - Honório Serpa",{"v":4109658,"d":"41.09.6.58"}]
[null,"PR","Ibaiti","PR - Ibaiti",{"v":4109708,"d":"41.09.7.08"}]
[null,"PR","Ibema","PR - Ibema",{"v":4109757,"d":"41.09.7.57"}]
[null,"PR","Ibiporã","PR - Ibiporã",{"v":4109807,"d":"41.09.8.07"}]
[null,"PR","Icaraíma","PR - Icaraíma",{"v":4109906,"d":"41.09.9.06"}]
[null,"PR","Iguaraçu","PR - Iguaraçu",{"v":4110003,"d":"41.10.0.03"}]
[null,"PR","Iguatu","PR - Iguatu",{"v":4110052,"d":"41.10.0.52"}]
[null,"PR","Imbaú","PR - Imbaú",{"v":4110078,"d":"41.10.0.78"}]
[null,"PR","Imbituva","PR - Imbituva",{"v":4110102,"d":"41.10.1.02"}]
[null,"PR","Inácio Martins","PR - Inácio Martins",{"v":4110201,"d":"41.10.2.01"}]
[null,"PR","Inajá","PR - Inajá",{"v":4110300,"d":"41.10.3.00"}]
[null,"PR","Indianópolis","PR - Indianópolis",{"v":4110409,"d":"41.10.4.09"}]
[null,"PR","Ipiranga","PR - Ipiranga",{"v":4110508,"d":"41.10.5.08"}]
[null,"PR","Iporã","PR - Iporã",{"v":4110607,"d":"41.10.6.07"}]
[null,"PR","Iracema do Oeste","PR - Iracema do Oeste",{"v":4110656,"d":"41.10.6.56"}]
[null,"PR","Irati","PR - Irati",{"v":4110706,"d":"41.10.7.06"}]
[null,"PR","Iretama","PR - Iretama",{"v":4110805,"d":"41.10.8.05"}]
[null,"PR","Itaguajé","PR - Itaguajé",{"v":4110904,"d":"41.10.9.04"}]
[null,"PR","Itaipulândia","PR - Itaipulândia",{"v":4110953,"d":"41.10.9.53"}]
[null,"PR","Itambaracá","PR - Itambaracá",{"v":4111001,"d":"41.11.0.01"}]
[null,"PR","Itambé","PR - Itambé",{"v":4111100,"d":"41.11.1.00"}]
[null,"PR","Itapejara d'Oeste","PR - Itapejara d'Oeste",{"v":4111209,"d":"41.11.2.09"}]
[null,"PR","Itaperuçu","PR - Itaperuçu",{"v":4111258,"d":"41.11.2.58"}]
[null,"PR","Itaúna do Sul","PR - Itaúna do Sul",{"v":4111308,"d":"41.11.3.08"}]
[null,"PR","Ivaí","PR - Ivaí",{"v":4111407,"d":"41.11.4.07"}]
[null,"PR","Ivaiporã","PR - Ivaiporã",{"v":4111506,"d":"41.11.5.06"}]
[null,"PR","Ivaté","PR - Ivaté",{"v":4111555,"d":"41.11.5.55"}]
[null,"PR","Ivatuba","PR - Ivatuba",{"v":4111605,"d":"41.11.6.05"}]
[null,"PR","Jaboti","PR - Jaboti",{"v":4111704,"d":"41.11.7.04"}]
[null,"PR","Jacarezinho","PR - Jacarezinho",{"v":4111803,"d":"41.11.8.03"}]
[null,"PR","Jaguapitã","PR - Jaguapitã",{"v":4111902,"d":"41.11.9.02"}]
[null,"PR","Jaguariaíva","PR - Jaguariaíva",{"v":4112009,"d":"41.12.0.09"}]
[null,"PR","Jandaia do Sul","PR - Jandaia do Sul",{"v":4112108,"d":"41.12.1.08"}]
[null,"PR","Janiópolis","PR - Janiópolis",{"v":4112207,"d":"41.12.2.07"}]
[null,"PR","Japira","PR - Japira",{"v":4112306,"d":"41.12.3.06"}]
[null,"PR","Japurá","PR - Japurá",{"v":4112405,"d":"41.12.4.05"}]
[null,"PR","Jardim Alegre","PR - Jardim Alegre",{"v":4112504,"d":"41.12.5.04"}]
[null,"PR","Jardim Olinda","PR - Jardim Olinda",{"v":4112603,"d":"41.12.6.03"}]
[null,"PR","Jataizinho","PR - Jataizinho",{"v":4112702,"d":"41.12.7.02"}]
[null,"PR","Jesuítas","PR - Jesuítas",{"v":4112751,"d":"41.12.7.51"}]
[null,"PR","Joaquim Távora","PR - Joaquim Távora",{"v":4112801,"d":"41.12.8.01"}]
[null,"PR","Jundiaí do Sul","PR - Jundiaí do Sul",{"v":4112900,"d":"41.12.9.00"}]
[null,"PR","Juranda","PR - Juranda",{"v":4112959,"d":"41.12.9.59"}]
[null,"PR","Jussara","PR - Jussara",{"v":4113007,"d":"41.13.0.07"}]
[null,"PR","Kaloré","PR - Kaloré",{"v":4113106,"d":"41.13.1.06"}]
[null,"PR","Lapa","PR - Lapa",{"v":4113205,"d":"41.13.2.05"}]
[null,"PR","Laranjal","PR - Laranjal",{"v":4113254,"d":"41.13.2.54"}]
[null,"PR","Laranjeiras do Sul","PR - Laranjeiras do Sul",{"v":4113304,"d":"41.13.3.04"}]
[null,"PR","Leópolis","PR - Leópolis",{"v":4113403,"d":"41.13.4.03"}]
[null,"PR","Lidianópolis","PR - Lidianópolis",{"v":4113429,"d":"41.13.4.29"}]
[null,"PR","Lindoeste","PR - Lindoeste",{"v":4113452,"d":"41.13.4.52"}]
[null,"PR","Loanda","PR - Loanda",{"v":4113502,"d":"41.13.5.02"}]
[null,"PR","Lobato","PR - Lobato",{"v":4113601,"d":"41.13.6.01"}]
[null,"PR","Londrina","PR - Londrina",{"v":4113700,"d":"41.13.7.00"}]
[null,"PR","Luiziana","PR - Luiziana",{"v":4113734,"d":"41.13.7.34"}]
[null,"PR","Lunardelli","PR - Lunardelli",{"v":4113759,"d":"41.13.7.59"}]
[null,"PR","Lupionópolis","PR - Lupionópolis",{"v":4113809,"d":"41.13.8.09"}]
[null,"PR","Mallet",{"$f":"CONCATENATE(B3423,\" - \",C3423)","v":"PR - Mallet"},{"v":4113908,"d":"41.13.9.08"}]
[null,"PR","Mamborê","PR - Mamborê",{"v":4114005,"d":"41.14.0.05"}]
[null,"PR","Mandaguaçu","PR - Mandaguaçu",{"v":4114104,"d":"41.14.1.04"}]
[null,"PR","Mandaguari","PR - Mandaguari",{"v":4114203,"d":"41.14.2.03"}]
[null,"PR","Mandirituba","PR - Mandirituba",{"v":4114302,"d":"41.14.3.02"}]
[null,"PR","Manfrinópolis","PR - Manfrinópolis",{"v":4114351,"d":"41.14.3.51"}]
[null,"PR","Mangueirinha","PR - Mangueirinha",{"v":4114401,"d":"41.14.4.01"}]
[null,"PR","Manoel Ribas","PR - Manoel Ribas",{"v":4114500,"d":"41.14.5.00"}]
[null,"PR","Marechal Cândido Rondon","PR - Marechal Cândido Rondon",{"v":4114609,"d":"41.14.6.09"}]
[null,"PR","Maria Helena","PR - Maria Helena",{"v":4114708,"d":"41.14.7.08"}]
[null,"PR","Marialva","PR - Marialva",{"v":4114807,"d":"41.14.8.07"}]
[null,"PR","Marilândia do Sul","PR - Marilândia do Sul",{"v":4114906,"d":"41.14.9.06"}]
[null,"PR","Marilena","PR - Marilena",{"v":4115002,"d":"41.15.0.02"}]
[null,"PR","Mariluz","PR - Mariluz",{"v":4115101,"d":"41.15.1.01"}]
[null,"PR","Maringá","PR - Maringá",{"v":4115200,"d":"41.15.2.00"}]
[null,"PR","Mariópolis","PR - Mariópolis",{"v":4115309,"d":"41.15.3.09"}]
[null,"PR","Maripá","PR - Maripá",{"v":4115358,"d":"41.15.3.58"}]
[null,"PR","Marmeleiro","PR - Marmeleiro",{"v":4115408,"d":"41.15.4.08"}]
[null,"PR","Marquinho","PR - Marquinho",{"v":4115457,"d":"41.15.4.57"}]
[null,"PR","Marumbi","PR - Marumbi",{"v":4115507,"d":"41.15.5.07"}]
[null,"PR","Matelândia","PR - Matelândia",{"v":4115606,"d":"41.15.6.06"}]
[null,"PR","Matinhos","PR - Matinhos",{"v":4115705,"d":"41.15.7.05"}]
[null,"PR","Mato Rico","PR - Mato Rico",{"v":4115739,"d":"41.15.7.39"}]
[null,"PR","Mauá da Serra","PR - Mauá da Serra",{"v":4115754,"d":"41.15.7.54"}]
[null,"PR","Medianeira","PR - Medianeira",{"v":4115804,"d":"41.15.8.04"}]
[null,"PR","Mercedes","PR - Mercedes",{"v":4115853,"d":"41.15.8.53"}]
[null,"PR","Mirador","PR - Mirador",{"v":4115903,"d":"41.15.9.03"}]
[null,"PR","Miraselva","PR - Miraselva",{"v":4116000,"d":"41.16.0.00"}]
[null,"PR","Missal","PR - Missal",{"v":4116059,"d":"41.16.0.59"}]
[null,"PR","Moreira Sales","PR - Moreira Sales",{"v":4116109,"d":"41.16.1.09"}]
[null,"PR","Morretes","PR - Morretes",{"v":4116208,"d":"41.16.2.08"}]
[null,"PR","Munhoz de Melo","PR - Munhoz de Melo",{"v":4116307,"d":"41.16.3.07"}]
[null,"PR","Nossa Senhora das Graças","PR - Nossa Senhora das Graças",{"v":4116406,"d":"41.16.4.06"}]
[null,"PR","Nova Aliança do Ivaí","PR - Nova Aliança do Ivaí",{"v":4116505,"d":"41.16.5.05"}]
[null,"PR","Nova América da Colina","PR - Nova América da Colina",{"v":4116604,"d":"41.16.6.04"}]
[null,"PR","Nova Aurora","PR - Nova Aurora",{"v":4116703,"d":"41.16.7.03"}]
[null,"PR","Nova Cantu","PR - Nova Cantu",{"v":4116802,"d":"41.16.8.02"}]
[null,"PR","Nova Esperança","PR - Nova Esperança",{"v":4116901,"d":"41.16.9.01"}]
[null,"PR","Nova Esperança do Sudoeste","PR - Nova Esperança do Sudoeste",{"v":4116950,"d":"41.16.9.50"}]
[null,"PR","Nova Fátima","PR - Nova Fátima",{"v":4117008,"d":"41.17.0.08"}]
[null,"PR","Nova Laranjeiras","PR - Nova Laranjeiras",{"v":4117057,"d":"41.17.0.57"}]
[null,"PR","Nova Londrina","PR - Nova Londrina",{"v":4117107,"d":"41.17.1.07"}]
[null,"PR","Nova Olímpia","PR - Nova Olímpia",{"v":4117206,"d":"41.17.2.06"}]
[null,"PR","Nova Prata do Iguaçu","PR - Nova Prata do Iguaçu",{"v":4117255,"d":"41.17.2.55"}]
[null,"PR","Nova Santa Bárbara","PR - Nova Santa Bárbara",{"v":4117214,"d":"41.17.2.14"}]
[null,"PR","Nova Santa Rosa","PR - Nova Santa Rosa",{"v":4117222,"d":"41.17.2.22"}]
[null,"PR","Nova Tebas","PR - Nova Tebas",{"v":4117271,"d":"41.17.2.71"}]
[null,"PR","Novo Itacolomi","PR - Novo Itacolomi",{"v":4117297,"d":"41.17.2.97"}]
[null,"PR","Ortigueira","PR - Ortigueira",{"v":4117305,"d":"41.17.3.05"}]
[null,"PR","Ourizona","PR - Ourizona",{"v":4117404,"d":"41.17.4.04"}]
[null,"PR","Ouro Verde do Oeste","PR - Ouro Verde do Oeste",{"v":4117453,"d":"41.17.4.53"}]
[null,"PR","Paiçandu","PR - Paiçandu",{"v":4117503,"d":"41.17.5.03"}]
[null,"PR","Palmas","PR - Palmas",{"v":4117602,"d":"41.17.6.02"}]
[null,"PR","Palmeira","PR - Palmeira",{"v":4117701,"d":"41.17.7.01"}]
[null,"PR","Palmital","PR - Palmital",{"v":4117800,"d":"41.17.8.00"}]
[null,"PR","Palotina","PR - Palotina",{"v":4117909,"d":"41.17.9.09"}]
[null,"PR","Paraíso do Norte","PR - Paraíso do Norte",{"v":4118006,"d":"41.18.0.06"}]
[null,"PR","Paranacity","PR - Paranacity",{"v":4118105,"d":"41.18.1.05"}]
[null,"PR","Paranaguá","PR - Paranaguá",{"v":4118204,"d":"41.18.2.04"}]
[null,"PR","Paranapoema","PR - Paranapoema",{"v":4118303,"d":"41.18.3.03"}]
[null,"PR","Paranavaí","PR - Paranavaí",{"v":4118402,"d":"41.18.4.02"}]
[null,"PR","Pato Bragado","PR - Pato Bragado",{"v":4118451,"d":"41.18.4.51"}]
[null,"PR","Pato Branco","PR - Pato Branco",{"v":4118501,"d":"41.18.5.01"}]
[null,"PR","Paula Freitas","PR - Paula Freitas",{"v":4118600,"d":"41.18.6.00"}]
[null,"PR","Paulo Frontin",{"$f":"CONCATENATE(B3487,\" - \",C3487)","v":"PR - Paulo Frontin"},{"v":4118709,"d":"41.18.7.09"}]
[null,"PR","Peabiru","PR - Peabiru",{"v":4118808,"d":"41.18.8.08"}]
[null,"PR","Perobal","PR - Perobal",{"v":4118857,"d":"41.18.8.57"}]
[null,"PR","Pérola","PR - Pérola",{"v":4118907,"d":"41.18.9.07"}]
[null,"PR","Pérola d'Oeste","PR - Pérola d'Oeste",{"v":4119004,"d":"41.19.0.04"}]
[null,"PR","Piên","PR - Piên",{"v":4119103,"d":"41.19.1.03"}]
[null,"PR","Pinhais","PR - Pinhais",{"v":4119152,"d":"41.19.1.52"}]
[null,"PR","Pinhal de São Bento","PR - Pinhal de São Bento",{"v":4119251,"d":"41.19.2.51"}]
[null,"PR","Pinhalão","PR - Pinhalão",{"v":4119202,"d":"41.19.2.02"}]
[null,"PR","Pinhão","PR - Pinhão",{"v":4119301,"d":"41.19.3.01"}]
[null,"PR","Piraí do Sul","PR - Piraí do Sul",{"v":4119400,"d":"41.19.4.00"}]
[null,"PR","Piraquara","PR - Piraquara",{"v":4119509,"d":"41.19.5.09"}]
[null,"PR","Pitanga","PR - Pitanga",{"v":4119608,"d":"41.19.6.08"}]
[null,"PR","Pitangueiras","PR - Pitangueiras",{"v":4119657,"d":"41.19.6.57"}]
[null,"PR","Planaltina do Paraná","PR - Planaltina do Paraná",{"v":4119707,"d":"41.19.7.07"}]
[null,"PR","Planalto","PR - Planalto",{"v":4119806,"d":"41.19.8.06"}]
[null,"PR","Ponta Grossa","PR - Ponta Grossa",{"v":4119905,"d":"41.19.9.05"}]
[null,"PR","Pontal do Paraná","PR - Pontal do Paraná",{"v":4119954,"d":"41.19.9.54"}]
[null,"PR","Porecatu","PR - Porecatu",{"v":4120002,"d":"41.20.0.02"}]
[null,"PR","Porto Amazonas","PR - Porto Amazonas",{"v":4120101,"d":"41.20.1.01"}]
[null,"PR","Porto Barreiro","PR - Porto Barreiro",{"v":4120150,"d":"41.20.1.50"}]
[null,"PR","Porto Rico","PR - Porto Rico",{"v":4120200,"d":"41.20.2.00"}]
[null,"PR","Porto Vitória","PR - Porto Vitória",{"v":4120309,"d":"41.20.3.09"}]
[null,"PR","Prado Ferreira","PR - Prado Ferreira",{"v":4120333,"d":"41.20.3.33"}]
[null,"PR","Pranchita","PR - Pranchita",{"v":4120358,"d":"41.20.3.58"}]
[null,"PR","Presidente Castelo Branco","PR - Presidente Castelo Branco",{"v":4120408,"d":"41.20.4.08"}]
[null,"PR","Primeiro de Maio","PR - Primeiro de Maio",{"v":4120507,"d":"41.20.5.07"}]
[null,"PR","Prudentópolis","PR - Prudentópolis",{"v":4120606,"d":"41.20.6.06"}]
[null,"PR","Quarto Centenário","PR - Quarto Centenário",{"v":4120655,"d":"41.20.6.55"}]
[null,"PR","Quatiguá","PR - Quatiguá",{"v":4120705,"d":"41.20.7.05"}]
[null,"PR","Quatro Barras","PR - Quatro Barras",{"v":4120804,"d":"41.20.8.04"}]
[null,"PR","Quatro Pontes","PR - Quatro Pontes",{"v":4120853,"d":"41.20.8.53"}]
[null,"PR","Quedas do Iguaçu","PR - Quedas do Iguaçu",{"v":4120903,"d":"41.20.9.03"}]
[null,"PR","Querência do Norte","PR - Querência do Norte",{"v":4121000,"d":"41.21.0.00"}]
[null,"PR","Quinta do Sol","PR - Quinta do Sol",{"v":4121109,"d":"41.21.1.09"}]
[null,"PR","Quitandinha","PR - Quitandinha",{"v":4121208,"d":"41.21.2.08"}]
[null,"PR","Ramilândia","PR - Ramilândia",{"v":4121257,"d":"41.21.2.57"}]
[null,"PR","Rancho Alegre","PR - Rancho Alegre",{"v":4121307,"d":"41.21.3.07"}]
[null,"PR","Rancho Alegre D'Oeste","PR - Rancho Alegre D'Oeste",{"v":4121356,"d":"41.21.3.56"}]
[null,"PR","Realeza","PR - Realeza",{"v":4121406,"d":"41.21.4.06"}]
[null,"PR","Rebouças","PR - Rebouças",{"v":4121505,"d":"41.21.5.05"}]
[null,"PR","Renascença","PR - Renascença",{"v":4121604,"d":"41.21.6.04"}]
[null,"PR","Reserva","PR - Reserva",{"v":4121703,"d":"41.21.7.03"}]
[null,"PR","Reserva do Iguaçu","PR - Reserva do Iguaçu",{"v":4121752,"d":"41.21.7.52"}]
[null,"PR","Ribeirão Claro","PR - Ribeirão Claro",{"v":4121802,"d":"41.21.8.02"}]
[null,"PR","Ribeirão do Pinhal","PR - Ribeirão do Pinhal",{"v":4121901,"d":"41.21.9.01"}]
[null,"PR","Rio Azul","PR - Rio Azul",{"v":4122008,"d":"41.22.0.08"}]
[null,"PR","Rio Bom","PR - Rio Bom",{"v":4122107,"d":"41.22.1.07"}]
[null,"PR","Rio Bonito do Iguaçu","PR - Rio Bonito do Iguaçu",{"v":4122156,"d":"41.22.1.56"}]
[null,"PR","Rio Branco do Ivaí","PR - Rio Branco do Ivaí",{"v":4122172,"d":"41.22.1.72"}]
[null,"PR","Rio Branco do Sul","PR - Rio Branco do Sul",{"v":4122206,"d":"41.22.2.06"}]
[null,"PR","Rio Negro","PR - Rio Negro",{"v":4122305,"d":"41.22.3.05"}]
[null,"PR","Rolândia","PR - Rolândia",{"v":4122404,"d":"41.22.4.04"}]
[null,"PR","Roncador","PR - Roncador",{"v":4122503,"d":"41.22.5.03"}]
[null,"PR","Rondon","PR - Rondon",{"v":4122602,"d":"41.22.6.02"}]
[null,"PR","Rosário do Ivaí","PR - Rosário do Ivaí",{"v":4122651,"d":"41.22.6.51"}]
[null,"PR","Sabáudia","PR - Sabáudia",{"v":4122701,"d":"41.22.7.01"}]
[null,"PR","Salgado Filho","PR - Salgado Filho",{"v":4122800,"d":"41.22.8.00"}]
[null,"PR","Salto do Itararé","PR - Salto do Itararé",{"v":4122909,"d":"41.22.9.09"}]
[null,"PR","Salto do Lontra","PR - Salto do Lontra",{"v":4123006,"d":"41.23.0.06"}]
[null,"PR","Santa Amélia","PR - Santa Amélia",{"v":4123105,"d":"41.23.1.05"}]
[null,"PR","Santa Cecília do Pavão","PR - Santa Cecília do Pavão",{"v":4123204,"d":"41.23.2.04"}]
[null,"PR","Santa Cruz de Monte Castelo","PR - Santa Cruz de Monte Castelo",{"v":4123303,"d":"41.23.3.03"}]
[null,"PR","Santa Fé","PR - Santa Fé",{"v":4123402,"d":"41.23.4.02"}]
[null,"PR","Santa Helena",{"$f":"CONCATENATE(B3551,\" - \",C3551)","v":"PR - Santa Helena"},{"v":4123501,"d":"41.23.5.01"}]
[null,"PR","Santa Inês","PR - Santa Inês",{"v":4123600,"d":"41.23.6.00"}]
[null,"PR","Santa Isabel do Ivaí","PR - Santa Isabel do Ivaí",{"v":4123709,"d":"41.23.7.09"}]
[null,"PR","Santa Izabel do Oeste","PR - Santa Izabel do Oeste",{"v":4123808,"d":"41.23.8.08"}]
[null,"PR","Santa Lúcia","PR - Santa Lúcia",{"v":4123824,"d":"41.23.8.24"}]
[null,"PR","Santa Maria do Oeste","PR - Santa Maria do Oeste",{"v":4123857,"d":"41.23.8.57"}]
[null,"PR","Santa Mariana","PR - Santa Mariana",{"v":4123907,"d":"41.23.9.07"}]
[null,"PR","Santa Mônica","PR - Santa Mônica",{"v":4123956,"d":"41.23.9.56"}]
[null,"PR","Santa Tereza do Oeste","PR - Santa Tereza do Oeste",{"v":4124020,"d":"41.24.0.20"}]
[null,"PR","Santa Terezinha de Itaipu","PR - Santa Terezinha de Itaipu",{"v":4124053,"d":"41.24.0.53"}]
[null,"PR","Santana do Itararé","PR - Santana do Itararé",{"v":4124004,"d":"41.24.0.04"}]
[null,"PR","Santo Antônio da Platina","PR - Santo Antônio da Platina",{"v":4124103,"d":"41.24.1.03"}]
[null,"PR","Santo Antônio do Caiuá","PR - Santo Antônio do Caiuá",{"v":4124202,"d":"41.24.2.02"}]
[null,"PR","Santo Antônio do Paraíso","PR - Santo Antônio do Paraíso",{"v":4124301,"d":"41.24.3.01"}]
[null,"PR","Santo Antônio do Sudoeste","PR - Santo Antônio do Sudoeste",{"v":4124400,"d":"41.24.4.00"}]
[null,"PR","Santo Inácio","PR - Santo Inácio",{"v":4124509,"d":"41.24.5.09"}]
[null,"PR","São Carlos do Ivaí","PR - São Carlos do Ivaí",{"v":4124608,"d":"41.24.6.08"}]
[null,"PR","São Jerônimo da Serra","PR - São Jerônimo da Serra",{"v":4124707,"d":"41.24.7.07"}]
[null,"PR","São João","PR - São João",{"v":4124806,"d":"41.24.8.06"}]
[null,"PR","São João do Caiuá","PR - São João do Caiuá",{"v":4124905,"d":"41.24.9.05"}]
[null,"PR","São João do Ivaí","PR - São João do Ivaí",{"v":4125001,"d":"41.25.0.01"}]
[null,"PR","São João do Triunfo","PR - São João do Triunfo",{"v":4125100,"d":"41.25.1.00"}]
[null,"PR","São Jorge do Ivaí","PR - São Jorge do Ivaí",{"v":4125308,"d":"41.25.3.08"}]
[null,"PR","São Jorge do Patrocínio","PR - São Jorge do Patrocínio",{"v":4125357,"d":"41.25.3.57"}]
[null,"PR","São Jorge d'Oeste","PR - São Jorge d'Oeste",{"v":4125209,"d":"41.25.2.09"}]
[null,"PR","São José da Boa Vista","PR - São José da Boa Vista",{"v":4125407,"d":"41.25.4.07"}]
[null,"PR","São José das Palmeiras","PR - São José das Palmeiras",{"v":4125456,"d":"41.25.4.56"}]
[null,"PR","São José dos Pinhais","PR - São José dos Pinhais",{"v":4125506,"d":"41.25.5.06"}]
[null,"PR","São Manoel do Paraná","PR - São Manoel do Paraná",{"v":4125555,"d":"41.25.5.55"}]
[null,"PR","São Mateus do Sul","PR - São Mateus do Sul",{"v":4125605,"d":"41.25.6.05"}]
[null,"PR","São Miguel do Iguaçu","PR - São Miguel do Iguaçu",{"v":4125704,"d":"41.25.7.04"}]
[null,"PR","São Pedro do Iguaçu","PR - São Pedro do Iguaçu",{"v":4125753,"d":"41.25.7.53"}]
[null,"PR","São Pedro do Ivaí","PR - São Pedro do Ivaí",{"v":4125803,"d":"41.25.8.03"}]
[null,"PR","São Pedro do Paraná","PR - São Pedro do Paraná",{"v":4125902,"d":"41.25.9.02"}]
[null,"PR","São Sebastião da Amoreira","PR - São Sebastião da Amoreira",{"v":4126009,"d":"41.26.0.09"}]
[null,"PR","São Tomé","PR - São Tomé",{"v":4126108,"d":"41.26.1.08"}]
[null,"PR","Sapopema","PR - Sapopema",{"v":4126207,"d":"41.26.2.07"}]
[null,"PR","Sarandi","PR - Sarandi",{"v":4126256,"d":"41.26.2.56"}]
[null,"PR","Saudade do Iguaçu","PR - Saudade do Iguaçu",{"v":4126272,"d":"41.26.2.72"}]
[null,"PR","Sengés","PR - Sengés",{"v":4126306,"d":"41.26.3.06"}]
[null,"PR","Serranópolis do Iguaçu","PR - Serranópolis do Iguaçu",{"v":4126355,"d":"41.26.3.55"}]
[null,"PR","Sertaneja","PR - Sertaneja",{"v":4126405,"d":"41.26.4.05"}]
[null,"PR","Sertanópolis","PR - Sertanópolis",{"v":4126504,"d":"41.26.5.04"}]
[null,"PR","Siqueira Campos","PR - Siqueira Campos",{"v":4126603,"d":"41.26.6.03"}]
[null,"PR","Sulina","PR - Sulina",{"v":4126652,"d":"41.26.6.52"}]
[null,"PR","Tamarana","PR - Tamarana",{"v":4126678,"d":"41.26.6.78"}]
[null,"PR","Tamboara","PR - Tamboara",{"v":4126702,"d":"41.26.7.02"}]
[null,"PR","Tapejara","PR - Tapejara",{"v":4126801,"d":"41.26.8.01"}]
[null,"PR","Tapira","PR - Tapira",{"v":4126900,"d":"41.26.9.00"}]
[null,"PR","Teixeira Soares","PR - Teixeira Soares",{"v":4127007,"d":"41.27.0.07"}]
[null,"PR","Telêmaco Borba","PR - Telêmaco Borba",{"v":4127106,"d":"41.27.1.06"}]
[null,"PR","Terra Boa","PR - Terra Boa",{"v":4127205,"d":"41.27.2.05"}]
[null,"PR","Terra Rica","PR - Terra Rica",{"v":4127304,"d":"41.27.3.04"}]
[null,"PR","Terra Roxa","PR - Terra Roxa",{"v":4127403,"d":"41.27.4.03"}]
[null,"PR","Tibagi","PR - Tibagi",{"v":4127502,"d":"41.27.5.02"}]
[null,"PR","Tijucas do Sul","PR - Tijucas do Sul",{"v":4127601,"d":"41.27.6.01"}]
[null,"PR","Toledo","PR - Toledo",{"v":4127700,"d":"41.27.7.00"}]
[null,"PR","Tomazina","PR - Tomazina",{"v":4127809,"d":"41.27.8.09"}]
[null,"PR","Três Barras do Paraná","PR - Três Barras do Paraná",{"v":4127858,"d":"41.27.8.58"}]
[null,"PR","Tunas do Paraná","PR - Tunas do Paraná",{"v":4127882,"d":"41.27.8.82"}]
[null,"PR","Tuneiras do Oeste","PR - Tuneiras do Oeste",{"v":4127908,"d":"41.27.9.08"}]
[null,"PR","Tupãssi","PR - Tupãssi",{"v":4127957,"d":"41.27.9.57"}]
[null,"PR","Turvo","PR - Turvo",{"v":4127965,"d":"41.27.9.65"}]
[null,"PR","Ubiratã","PR - Ubiratã",{"v":4128005,"d":"41.28.0.05"}]
[null,"PR","Umuarama",{"$f":"CONCATENATE(B3615,\" - \",C3615)","v":"PR - Umuarama"},{"v":4128104,"d":"41.28.1.04"}]
[null,"PR","União da Vitória","PR - União da Vitória",{"v":4128203,"d":"41.28.2.03"}]
[null,"PR","Uniflor","PR - Uniflor",{"v":4128302,"d":"41.28.3.02"}]
[null,"PR","Uraí","PR - Uraí",{"v":4128401,"d":"41.28.4.01"}]
[null,"PR","Ventania","PR - Ventania",{"v":4128534,"d":"41.28.5.34"}]
[null,"PR","Vera Cruz do Oeste","PR - Vera Cruz do Oeste",{"v":4128559,"d":"41.28.5.59"}]
[null,"PR","Verê","PR - Verê",{"v":4128609,"d":"41.28.6.09"}]
[null,"PR","Virmond","PR - Virmond",{"v":4128658,"d":"41.28.6.58"}]
[null,"PR","Vitorino","PR - Vitorino",{"v":4128708,"d":"41.28.7.08"}]
[null,"PR","Wenceslau Braz","PR - Wenceslau Braz",{"v":4128500,"d":"41.28.5.00"}]
[null,"PR","Xambrê","PR - Xambrê",{"v":4128807,"d":"41.28.8.07"}]
[null,"RJ","Angra dos Reis","RJ - Angra dos Reis",{"v":3300100,"d":"33.00.1.00"}]
[null,"RJ","Aperibé","RJ - Aperibé",{"v":3300159,"d":"33.00.1.59"}]
[null,"RJ","Araruama","RJ - Araruama",{"v":3300209,"d":"33.00.2.09"}]
[null,"RJ","Areal","RJ - Areal",{"v":3300225,"d":"33.00.2.25"}]
[null,"RJ","Armação dos Búzios","RJ - Armação dos Búzios",{"v":3300233,"d":"33.00.2.33"}]
[null,"RJ","Arraial do Cabo","RJ - Arraial do Cabo",{"v":3300258,"d":"33.00.2.58"}]
[null,"RJ","Barra do Piraí","RJ - Barra do Piraí",{"v":3300308,"d":"33.00.3.08"}]
[null,"RJ","Barra Mansa","RJ - Barra Mansa",{"v":3300407,"d":"33.00.4.07"}]
[null,"RJ","Belford Roxo","RJ - Belford Roxo",{"v":3300456,"d":"33.00.4.56"}]
[null,"RJ","Bom Jardim","RJ - Bom Jardim",{"v":3300506,"d":"33.00.5.06"}]
[null,"RJ","Bom Jesus do Itabapoana","RJ - Bom Jesus do Itabapoana",{"v":3300605,"d":"33.00.6.05"}]
[null,"RJ","Cabo Frio","RJ - Cabo Frio",{"v":3300704,"d":"33.00.7.04"}]
[null,"RJ","Cachoeiras de Macacu","RJ - Cachoeiras de Macacu",{"v":3300803,"d":"33.00.8.03"}]
[null,"RJ","Cambuci","RJ - Cambuci",{"v":3300902,"d":"33.00.9.02"}]
[null,"RJ","Campos dos Goytacazes","RJ - Campos dos Goytacazes",{"v":3301009,"d":"33.01.0.09"}]
[null,"RJ","Cantagalo","RJ - Cantagalo",{"v":3301108,"d":"33.01.1.08"}]
[null,"RJ","Carapebus","RJ - Carapebus",{"v":3300936,"d":"33.00.9.36"}]
[null,"RJ","Cardoso Moreira","RJ - Cardoso Moreira",{"v":3301157,"d":"33.01.1.57"}]
[null,"RJ","Carmo","RJ - Carmo",{"v":3301207,"d":"33.01.2.07"}]
[null,"RJ","Casimiro de Abreu","RJ - Casimiro de Abreu",{"v":3301306,"d":"33.01.3.06"}]
[null,"RJ","Comendador Levy Gasparian","RJ - Comendador Levy Gasparian",{"v":3300951,"d":"33.00.9.51"}]
[null,"RJ","Conceição de Macabu","RJ - Conceição de Macabu",{"v":3301405,"d":"33.01.4.05"}]
[null,"RJ","Cordeiro","RJ - Cordeiro",{"v":3301504,"d":"33.01.5.04"}]
[null,"RJ","Duas Barras","RJ - Duas Barras",{"v":3301603,"d":"33.01.6.03"}]
[null,"RJ","Duque de Caxias","RJ - Duque de Caxias",{"v":3301702,"d":"33.01.7.02"}]
[null,"RJ","Engenheiro Paulo de Frontin","RJ - Engenheiro Paulo de Frontin",{"v":3301801,"d":"33.01.8.01"}]
[null,"RJ","Guapimirim","RJ - Guapimirim",{"v":3301850,"d":"33.01.8.50"}]
[null,"RJ","Iguaba Grande","RJ - Iguaba Grande",{"v":3301876,"d":"33.01.8.76"}]
[null,"RJ","Itaboraí","RJ - Itaboraí",{"v":3301900,"d":"33.01.9.00"}]
[null,"RJ","Itaguaí","RJ - Itaguaí",{"v":3302007,"d":"33.02.0.07"}]
[null,"RJ","Italva","RJ - Italva",{"v":3302056,"d":"33.02.0.56"}]
[null,"RJ","Itaocara","RJ - Itaocara",{"v":3302106,"d":"33.02.1.06"}]
[null,"RJ","Itaperuna","RJ - Itaperuna",{"v":3302205,"d":"33.02.2.05"}]
[null,"RJ","Itatiaia","RJ - Itatiaia",{"v":3302254,"d":"33.02.2.54"}]
[null,"RJ","Japeri","RJ - Japeri",{"v":3302270,"d":"33.02.2.70"}]
[null,"RJ","Laje do Muriaé","RJ - Laje do Muriaé",{"v":3302304,"d":"33.02.3.04"}]
[null,"RJ","Macaé","RJ - Macaé",{"v":3302403,"d":"33.02.4.03"}]
[null,"RJ","Macuco","RJ - Macuco",{"v":3302452,"d":"33.02.4.52"}]
[null,"RJ","Magé","RJ - Magé",{"v":3302502,"d":"33.02.5.02"}]
[null,"RJ","Mangaratiba","RJ - Mangaratiba",{"v":3302601,"d":"33.02.6.01"}]
[null,"RJ","Maricá","RJ - Maricá",{"v":3302700,"d":"33.02.7.00"}]
[null,"RJ","Mendes","RJ - Mendes",{"v":3302809,"d":"33.02.8.09"}]
[null,"RJ","Mesquita","RJ - Mesquita",{"v":3302858,"d":"33.02.8.58"}]
[null,"RJ","Miguel Pereira","RJ - Miguel Pereira",{"v":3302908,"d":"33.02.9.08"}]
[null,"RJ","Miracema","RJ - Miracema",{"v":3303005,"d":"33.03.0.05"}]
[null,"RJ","Natividade","RJ - Natividade",{"v":3303104,"d":"33.03.1.04"}]
[null,"RJ","Nilópolis","RJ - Nilópolis",{"v":3303203,"d":"33.03.2.03"}]
[null,"RJ","Niterói","RJ - Niterói",{"v":3303302,"d":"33.03.3.02"}]
[null,"RJ","Nova Friburgo","RJ - Nova Friburgo",{"v":3303401,"d":"33.03.4.01"}]
[null,"RJ","Nova Iguaçu","RJ - Nova Iguaçu",{"v":3303500,"d":"33.03.5.00"}]
[null,"RJ","Paracambi","RJ - Paracambi",{"v":3303609,"d":"33.03.6.09"}]
[null,"RJ","Paraíba do Sul","RJ - Paraíba do Sul",{"v":3303708,"d":"33.03.7.08"}]
[null,"RJ","Paraty","RJ - Paraty",{"v":3303807,"d":"33.03.8.07"}]
[null,"RJ","Paty do Alferes",{"$f":"CONCATENATE(B3679,\" - \",C3679)","v":"RJ - Paty do Alferes"},{"v":3303856,"d":"33.03.8.56"}]
[null,"RJ","Petrópolis","RJ - Petrópolis",{"v":3303906,"d":"33.03.9.06"}]
[null,"RJ","Pinheiral","RJ - Pinheiral",{"v":3303955,"d":"33.03.9.55"}]
[null,"RJ","Piraí","RJ - Piraí",{"v":3304003,"d":"33.04.0.03"}]
[null,"RJ","Porciúncula","RJ - Porciúncula",{"v":3304102,"d":"33.04.1.02"}]
[null,"RJ","Porto Real","RJ - Porto Real",{"v":3304110,"d":"33.04.1.10"}]
[null,"RJ","Quatis","RJ - Quatis",{"v":3304128,"d":"33.04.1.28"}]
[null,"RJ","Queimados","RJ - Queimados",{"v":3304144,"d":"33.04.1.44"}]
[null,"RJ","Quissamã","RJ - Quissamã",{"v":3304151,"d":"33.04.1.51"}]
[null,"RJ","Resende","RJ - Resende",{"v":3304201,"d":"33.04.2.01"}]
[null,"RJ","Rio Bonito","RJ - Rio Bonito",{"v":3304300,"d":"33.04.3.00"}]
[null,"RJ","Rio Claro","RJ - Rio Claro",{"v":3304409,"d":"33.04.4.09"}]
[null,"RJ","Rio das Flores","RJ - Rio das Flores",{"v":3304508,"d":"33.04.5.08"}]
[null,"RJ","Rio das Ostras","RJ - Rio das Ostras",{"v":3304524,"d":"33.04.5.24"}]
[null,"RJ","Rio de Janeiro","RJ - Rio de Janeiro",{"v":3304557,"d":"33.04.5.57"}]
[null,"RJ","Santa Maria Madalena","RJ - Santa Maria Madalena",{"v":3304607,"d":"33.04.6.07"}]
[null,"RJ","Santo Antônio de Pádua","RJ - Santo Antônio de Pádua",{"v":3304706,"d":"33.04.7.06"}]
[null,"RJ","São Fidélis","RJ - São Fidélis",{"v":3304805,"d":"33.04.8.05"}]
[null,"RJ","São Francisco de Itabapoana","RJ - São Francisco de Itabapoana",{"v":3304755,"d":"33.04.7.55"}]
[null,"RJ","São Gonçalo","RJ - São Gonçalo",{"v":3304904,"d":"33.04.9.04"}]
[null,"RJ","São João da Barra","RJ - São João da Barra",{"v":3305000,"d":"33.05.0.00"}]
[null,"RJ","São João de Meriti","RJ - São João de Meriti",{"v":3305109,"d":"33.05.1.09"}]
[null,"RJ","São José de Ubá","RJ - São José de Ubá",{"v":3305133,"d":"33.05.1.33"}]
[null,"RJ","São José do Vale do Rio Preto","RJ - São José do Vale do Rio Preto",{"v":3305158,"d":"33.05.1.58"}]
[null,"RJ","São Pedro da Aldeia","RJ - São Pedro da Aldeia",{"v":3305208,"d":"33.05.2.08"}]
[null,"RJ","São Sebastião do Alto","RJ - São Sebastião do Alto",{"v":3305307,"d":"33.05.3.07"}]
[null,"RJ","Sapucaia","RJ - Sapucaia",{"v":3305406,"d":"33.05.4.06"}]
[null,"RJ","Saquarema","RJ - Saquarema",{"v":3305505,"d":"33.05.5.05"}]
[null,"RJ","Seropédica","RJ - Seropédica",{"v":3305554,"d":"33.05.5.54"}]
[null,"RJ","Silva Jardim","RJ - Silva Jardim",{"v":3305604,"d":"33.05.6.04"}]
[null,"RJ","Sumidouro","RJ - Sumidouro",{"v":3305703,"d":"33.05.7.03"}]
[null,"RJ","Tanguá","RJ - Tanguá",{"v":3305752,"d":"33.05.7.52"}]
[null,"RJ","Teresópolis","RJ - Teresópolis",{"v":3305802,"d":"33.05.8.02"}]
[null,"RJ","Trajano de Moraes","RJ - Trajano de Moraes",{"v":3305901,"d":"33.05.9.01"}]
[null,"RJ","Três Rios","RJ - Três Rios",{"v":3306008,"d":"33.06.0.08"}]
[null,"RJ","Valença","RJ - Valença",{"v":3306107,"d":"33.06.1.07"}]
[null,"RJ","Varre-Sai","RJ - Varre-Sai",{"v":3306156,"d":"33.06.1.56"}]
[null,"RJ","Vassouras","RJ - Vassouras",{"v":3306206,"d":"33.06.2.06"}]
[null,"RJ","Volta Redonda","RJ - Volta Redonda",{"v":3306305,"d":"33.06.3.05"}]
[null,"RN","Acari","RN - Acari",{"v":2400109,"d":"24.00.1.09"}]
[null,"RN","Açu","RN - Açu",{"v":2400208,"d":"24.00.2.08"}]
[null,"RN","Afonso Bezerra","RN - Afonso Bezerra",{"v":2400307,"d":"24.00.3.07"}]
[null,"RN","Água Nova","RN - Água Nova",{"v":2400406,"d":"24.00.4.06"}]
[null,"RN","Alexandria","RN - Alexandria",{"v":2400505,"d":"24.00.5.05"}]
[null,"RN","Almino Afonso","RN - Almino Afonso",{"v":2400604,"d":"24.00.6.04"}]
[null,"RN","Alto do Rodrigues","RN - Alto do Rodrigues",{"v":2400703,"d":"24.00.7.03"}]
[null,"RN","Angicos","RN - Angicos",{"v":2400802,"d":"24.00.8.02"}]
[null,"RN","Antônio Martins","RN - Antônio Martins",{"v":2400901,"d":"24.00.9.01"}]
[null,"RN","Apodi","RN - Apodi",{"v":2401008,"d":"24.01.0.08"}]
[null,"RN","Areia Branca","RN - Areia Branca",{"v":2401107,"d":"24.01.1.07"}]
[null,"RN","Arês","RN - Arês",{"v":2401206,"d":"24.01.2.06"}]
[null,"RN","Augusto Severo","RN - Augusto Severo",{"v":2401305,"d":"24.01.3.05"}]
[null,"RN","Baía Formosa","RN - Baía Formosa",{"v":2401404,"d":"24.01.4.04"}]
[null,"RN","Baraúna","RN - Baraúna",{"v":2401453,"d":"24.01.4.53"}]
[null,"RN","Barcelona","RN - Barcelona",{"v":2401503,"d":"24.01.5.03"}]
[null,"RN","Bento Fernandes","RN - Bento Fernandes",{"v":2401602,"d":"24.01.6.02"}]
[null,"RN","Bodó","RN - Bodó",{"v":2401651,"d":"24.01.6.51"}]
[null,"RN","Bom Jesus","RN - Bom Jesus",{"v":2401701,"d":"24.01.7.01"}]
[null,"RN","Brejinho","RN - Brejinho",{"v":2401800,"d":"24.01.8.00"}]
[null,"RN","Caiçara do Norte","RN - Caiçara do Norte",{"v":2401859,"d":"24.01.8.59"}]
[null,"RN","Caiçara do Rio do Vento","RN - Caiçara do Rio do Vento",{"v":2401909,"d":"24.01.9.09"}]
[null,"RN","Caicó","RN - Caicó",{"v":2402006,"d":"24.02.0.06"}]
[null,"RN","Campo Redondo","RN - Campo Redondo",{"v":2402105,"d":"24.02.1.05"}]
[null,"RN","Canguaretama","RN - Canguaretama",{"v":2402204,"d":"24.02.2.04"}]
[null,"RN","Caraúbas",{"$f":"CONCATENATE(B3743,\" - \",C3743)","v":"RN - Caraúbas"},{"v":2402303,"d":"24.02.3.03"}]
[null,"RN","Carnaúba dos Dantas","RN - Carnaúba dos Dantas",{"v":2402402,"d":"24.02.4.02"}]
[null,"RN","Carnaubais","RN - Carnaubais",{"v":2402501,"d":"24.02.5.01"}]
[null,"RN","Ceará-Mirim","RN - Ceará-Mirim",{"v":2402600,"d":"24.02.6.00"}]
[null,"RN","Cerro Corá","RN - Cerro Corá",{"v":2402709,"d":"24.02.7.09"}]
[null,"RN","Coronel Ezequiel","RN - Coronel Ezequiel",{"v":2402808,"d":"24.02.8.08"}]
[null,"RN","Coronel João Pessoa","RN - Coronel João Pessoa",{"v":2402907,"d":"24.02.9.07"}]
[null,"RN","Cruzeta","RN - Cruzeta",{"v":2403004,"d":"24.03.0.04"}]
[null,"RN","Currais Novos","RN - Currais Novos",{"v":2403103,"d":"24.03.1.03"}]
[null,"RN","Doutor Severiano","RN - Doutor Severiano",{"v":2403202,"d":"24.03.2.02"}]
[null,"RN","Encanto","RN - Encanto",{"v":2403301,"d":"24.03.3.01"}]
[null,"RN","Equador","RN - Equador",{"v":2403400,"d":"24.03.4.00"}]
[null,"RN","Espírito Santo","RN - Espírito Santo",{"v":2403509,"d":"24.03.5.09"}]
[null,"RN","Extremoz","RN - Extremoz",{"v":2403608,"d":"24.03.6.08"}]
[null,"RN","Felipe Guerra","RN - Felipe Guerra",{"v":2403707,"d":"24.03.7.07"}]
[null,"RN","Fernando Pedroza","RN - Fernando Pedroza",{"v":2403756,"d":"24.03.7.56"}]
[null,"RN","Florânia","RN - Florânia",{"v":2403806,"d":"24.03.8.06"}]
[null,"RN","Francisco Dantas","RN - Francisco Dantas",{"v":2403905,"d":"24.03.9.05"}]
[null,"RN","Frutuoso Gomes","RN - Frutuoso Gomes",{"v":2404002,"d":"24.04.0.02"}]
[null,"RN","Galinhos","RN - Galinhos",{"v":2404101,"d":"24.04.1.01"}]
[null,"RN","Goianinha","RN - Goianinha",{"v":2404200,"d":"24.04.2.00"}]
[null,"RN","Governador Dix-Sept Rosado","RN - Governador Dix-Sept Rosado",{"v":2404309,"d":"24.04.3.09"}]
[null,"RN","Grossos","RN - Grossos",{"v":2404408,"d":"24.04.4.08"}]
[null,"RN","Guamaré","RN - Guamaré",{"v":2404507,"d":"24.04.5.07"}]
[null,"RN","Ielmo Marinho","RN - Ielmo Marinho",{"v":2404606,"d":"24.04.6.06"}]
[null,"RN","Ipanguaçu","RN - Ipanguaçu",{"v":2404705,"d":"24.04.7.05"}]
[null,"RN","Ipueira","RN - Ipueira",{"v":2404804,"d":"24.04.8.04"}]
[null,"RN","Itajá","RN - Itajá",{"v":2404853,"d":"24.04.8.53"}]
[null,"RN","Itaú","RN - Itaú",{"v":2404903,"d":"24.04.9.03"}]
[null,"RN","Jaçanã","RN - Jaçanã",{"v":2405009,"d":"24.05.0.09"}]
[null,"RN","Jandaíra","RN - Jandaíra",{"v":2405108,"d":"24.05.1.08"}]
[null,"RN","Janduís","RN - Janduís",{"v":2405207,"d":"24.05.2.07"}]
[null,"RN","Januário Cicco","RN - Januário Cicco",{"v":2405306,"d":"24.05.3.06"}]
[null,"RN","Japi","RN - Japi",{"v":2405405,"d":"24.05.4.05"}]
[null,"RN","Jardim de Angicos","RN - Jardim de Angicos",{"v":2405504,"d":"24.05.5.04"}]
[null,"RN","Jardim de Piranhas","RN - Jardim de Piranhas",{"v":2405603,"d":"24.05.6.03"}]
[null,"RN","Jardim do Seridó","RN - Jardim do Seridó",{"v":2405702,"d":"24.05.7.02"}]
[null,"RN","João Câmara","RN - João Câmara",{"v":2405801,"d":"24.05.8.01"}]
[null,"RN","João Dias","RN - João Dias",{"v":2405900,"d":"24.05.9.00"}]
[null,"RN","José da Penha","RN - José da Penha",{"v":2406007,"d":"24.06.0.07"}]
[null,"RN","Jucurutu","RN - Jucurutu",{"v":2406106,"d":"24.06.1.06"}]
[null,"RN","Jundiá","RN - Jundiá",{"v":2406155,"d":"24.06.1.55"}]
[null,"RN","Lagoa d'Anta","RN - Lagoa d'Anta",{"v":2406205,"d":"24.06.2.05"}]
[null,"RN","Lagoa de Pedras","RN - Lagoa de Pedras",{"v":2406304,"d":"24.06.3.04"}]
[null,"RN","Lagoa de Velhos","RN - Lagoa de Velhos",{"v":2406403,"d":"24.06.4.03"}]
[null,"RN","Lagoa Nova","RN - Lagoa Nova",{"v":2406502,"d":"24.06.5.02"}]
[null,"RN","Lagoa Salgada","RN - Lagoa Salgada",{"v":2406601,"d":"24.06.6.01"}]
[null,"RN","Lajes","RN - Lajes",{"v":2406700,"d":"24.06.7.00"}]
[null,"RN","Lajes Pintadas","RN - Lajes Pintadas",{"v":2406809,"d":"24.06.8.09"}]
[null,"RN","Lucrécia","RN - Lucrécia",{"v":2406908,"d":"24.06.9.08"}]
[null,"RN","Luís Gomes","RN - Luís Gomes",{"v":2407005,"d":"24.07.0.05"}]
[null,"RN","Macaíba","RN - Macaíba",{"v":2407104,"d":"24.07.1.04"}]
[null,"RN","Macau","RN - Macau",{"v":2407203,"d":"24.07.2.03"}]
[null,"RN","Major Sales","RN - Major Sales",{"v":2407252,"d":"24.07.2.52"}]
[null,"RN","Marcelino Vieira","RN - Marcelino Vieira",{"v":2407302,"d":"24.07.3.02"}]
[null,"RN","Martins","RN - Martins",{"v":2407401,"d":"24.07.4.01"}]
[null,"RN","Maxaranguape","RN - Maxaranguape",{"v":2407500,"d":"24.07.5.00"}]
[null,"RN","Messias Targino","RN - Messias Targino",{"v":2407609,"d":"24.07.6.09"}]
[null,"RN","Montanhas","RN - Montanhas",{"v":2407708,"d":"24.07.7.08"}]
[null,"RN","Monte Alegre","RN - Monte Alegre",{"v":2407807,"d":"24.07.8.07"}]
[null,"RN","Monte das Gameleiras","RN - Monte das Gameleiras",{"v":2407906,"d":"24.07.9.06"}]
[null,"RN","Mossoró","RN - Mossoró",{"v":2408003,"d":"24.08.0.03"}]
[null,"RN","Natal","RN - Natal",{"v":2408102,"d":"24.08.1.02"}]
[null,"RN","Nísia Floresta","RN - Nísia Floresta",{"v":2408201,"d":"24.08.2.01"}]
[null,"RN","Nova Cruz",{"$f":"CONCATENATE(B3807,\" - \",C3807)","v":"RN - Nova Cruz"},{"v":2408300,"d":"24.08.3.00"}]
[null,"RN","Olho-d'Água do Borges","RN - Olho-d'Água do Borges",{"v":2408409,"d":"24.08.4.09"}]
[null,"RN","Ouro Branco","RN - Ouro Branco",{"v":2408508,"d":"24.08.5.08"}]
[null,"RN","Paraná","RN - Paraná",{"v":2408607,"d":"24.08.6.07"}]
[null,"RN","Paraú","RN - Paraú",{"v":2408706,"d":"24.08.7.06"}]
[null,"RN","Parazinho","RN - Parazinho",{"v":2408805,"d":"24.08.8.05"}]
[null,"RN","Parelhas","RN - Parelhas",{"v":2408904,"d":"24.08.9.04"}]
[null,"RN","Parnamirim","RN - Parnamirim",{"v":2403251,"d":"24.03.2.51"}]
[null,"RN","Passa e Fica","RN - Passa e Fica",{"v":2409100,"d":"24.09.1.00"}]
[null,"RN","Passagem","RN - Passagem",{"v":2409209,"d":"24.09.2.09"}]
[null,"RN","Patu","RN - Patu",{"v":2409308,"d":"24.09.3.08"}]
[null,"RN","Pau dos Ferros","RN - Pau dos Ferros",{"v":2409407,"d":"24.09.4.07"}]
[null,"RN","Pedra Grande","RN - Pedra Grande",{"v":2409506,"d":"24.09.5.06"}]
[null,"RN","Pedra Preta","RN - Pedra Preta",{"v":2409605,"d":"24.09.6.05"}]
[null,"RN","Pedro Avelino","RN - Pedro Avelino",{"v":2409704,"d":"24.09.7.04"}]
[null,"RN","Pedro Velho","RN - Pedro Velho",{"v":2409803,"d":"24.09.8.03"}]
[null,"RN","Pendências","RN - Pendências",{"v":2409902,"d":"24.09.9.02"}]
[null,"RN","Pilões","RN - Pilões",{"v":2410009,"d":"24.10.0.09"}]
[null,"RN","Poço Branco","RN - Poço Branco",{"v":2410108,"d":"24.10.1.08"}]
[null,"RN","Portalegre","RN - Portalegre",{"v":2410207,"d":"24.10.2.07"}]
[null,"RN","Porto do Mangue","RN - Porto do Mangue",{"v":2410256,"d":"24.10.2.56"}]
[null,"RN","Presidente Juscelino","RN - Presidente Juscelino",{"v":2410306,"d":"24.10.3.06"}]
[null,"RN","Pureza","RN - Pureza",{"v":2410405,"d":"24.10.4.05"}]
[null,"RN","Rafael Fernandes","RN - Rafael Fernandes",{"v":2410504,"d":"24.10.5.04"}]
[null,"RN","Rafael Godeiro","RN - Rafael Godeiro",{"v":2410603,"d":"24.10.6.03"}]
[null,"RN","Riacho da Cruz","RN - Riacho da Cruz",{"v":2410702,"d":"24.10.7.02"}]
[null,"RN","Riacho de Santana","RN - Riacho de Santana",{"v":2410801,"d":"24.10.8.01"}]
[null,"RN","Riachuelo","RN - Riachuelo",{"v":2410900,"d":"24.10.9.00"}]
[null,"RN","Rio do Fogo","RN - Rio do Fogo",{"v":2408953,"d":"24.08.9.53"}]
[null,"RN","Rodolfo Fernandes","RN - Rodolfo Fernandes",{"v":2411007,"d":"24.11.0.07"}]
[null,"RN","Ruy Barbosa","RN - Ruy Barbosa",{"v":2411106,"d":"24.11.1.06"}]
[null,"RN","Santa Cruz","RN - Santa Cruz",{"v":2411205,"d":"24.11.2.05"}]
[null,"RN","Santa Maria","RN - Santa Maria",{"v":2409332,"d":"24.09.3.32"}]
[null,"RN","Santana do Matos","RN - Santana do Matos",{"v":2411403,"d":"24.11.4.03"}]
[null,"RN","Santana do Seridó","RN - Santana do Seridó",{"v":2411429,"d":"24.11.4.29"}]
[null,"RN","Santo Antônio","RN - Santo Antônio",{"v":2411502,"d":"24.11.5.02"}]
[null,"RN","São Bento do Norte","RN - São Bento do Norte",{"v":2411601,"d":"24.11.6.01"}]
[null,"RN","São Bento do Trairí","RN - São Bento do Trairí",{"v":2411700,"d":"24.11.7.00"}]
[null,"RN","São Fernando","RN - São Fernando",{"v":2411809,"d":"24.11.8.09"}]
[null,"RN","São Francisco do Oeste","RN - São Francisco do Oeste",{"v":2411908,"d":"24.11.9.08"}]
[null,"RN","São Gonçalo do Amarante","RN - São Gonçalo do Amarante",{"v":2412005,"d":"24.12.0.05"}]
[null,"RN","São João do Sabugi","RN - São João do Sabugi",{"v":2412104,"d":"24.12.1.04"}]
[null,"RN","São José de Mipibu","RN - São José de Mipibu",{"v":2412203,"d":"24.12.2.03"}]
[null,"RN","São José do Campestre","RN - São José do Campestre",{"v":2412302,"d":"24.12.3.02"}]
[null,"RN","São José do Seridó","RN - São José do Seridó",{"v":2412401,"d":"24.12.4.01"}]
[null,"RN","São Miguel","RN - São Miguel",{"v":2412500,"d":"24.12.5.00"}]
[null,"RN","São Miguel do Gostoso","RN - São Miguel do Gostoso",{"v":2412559,"d":"24.12.5.59"}]
[null,"RN","São Paulo do Potengi","RN - São Paulo do Potengi",{"v":2412609,"d":"24.12.6.09"}]
[null,"RN","São Pedro","RN - São Pedro",{"v":2412708,"d":"24.12.7.08"}]
[null,"RN","São Rafael","RN - São Rafael",{"v":2412807,"d":"24.12.8.07"}]
[null,"RN","São Tomé","RN - São Tomé",{"v":2412906,"d":"24.12.9.06"}]
[null,"RN","São Vicente","RN - São Vicente",{"v":2413003,"d":"24.13.0.03"}]
[null,"RN","Senador Elói de Souza","RN - Senador Elói de Souza",{"v":2413102,"d":"24.13.1.02"}]
[null,"RN","Senador Georgino Avelino","RN - Senador Georgino Avelino",{"v":2413201,"d":"24.13.2.01"}]
[null,"RN","Serra de São Bento","RN - Serra de São Bento",{"v":2413300,"d":"24.13.3.00"}]
[null,"RN","Serra do Mel","RN - Serra do Mel",{"v":2413359,"d":"24.13.3.59"}]
[null,"RN","Serra Negra do Norte","RN - Serra Negra do Norte",{"v":2413409,"d":"24.13.4.09"}]
[null,"RN","Serrinha","RN - Serrinha",{"v":2413508,"d":"24.13.5.08"}]
[null,"RN","Serrinha dos Pintos","RN - Serrinha dos Pintos",{"v":2413557,"d":"24.13.5.57"}]
[null,"RN","Severiano Melo","RN - Severiano Melo",{"v":2413607,"d":"24.13.6.07"}]
[null,"RN","Sítio Novo","RN - Sítio Novo",{"v":2413706,"d":"24.13.7.06"}]
[null,"RN","Taboleiro Grande","RN - Taboleiro Grande",{"v":2413805,"d":"24.13.8.05"}]
[null,"RN","Taipu","RN - Taipu",{"v":2413904,"d":"24.13.9.04"}]
[null,"RN","Tangará","RN - Tangará",{"v":2414001,"d":"24.14.0.01"}]
[null,"RN","Tenente Ananias",{"$f":"CONCATENATE(B3871,\" - \",C3871)","v":"RN - Tenente Ananias"},{"v":2414100,"d":"24.14.1.00"}]
[null,"RN","Tenente Laurentino Cruz","RN - Tenente Laurentino Cruz",{"v":2414159,"d":"24.14.1.59"}]
[null,"RN","Tibau","RN - Tibau",{"v":2411056,"d":"24.11.0.56"}]
[null,"RN","Tibau do Sul","RN - Tibau do Sul",{"v":2414209,"d":"24.14.2.09"}]
[null,"RN","Timbaúba dos Batistas","RN - Timbaúba dos Batistas",{"v":2414308,"d":"24.14.3.08"}]
[null,"RN","Touros","RN - Touros",{"v":2414407,"d":"24.14.4.07"}]
[null,"RN","Triunfo Potiguar","RN - Triunfo Potiguar",{"v":2414456,"d":"24.14.4.56"}]
[null,"RN","Umarizal","RN - Umarizal",{"v":2414506,"d":"24.14.5.06"}]
[null,"RN","Upanema","RN - Upanema",{"v":2414605,"d":"24.14.6.05"}]
[null,"RN","Várzea","RN - Várzea",{"v":2414704,"d":"24.14.7.04"}]
[null,"RN","Venha-Ver","RN - Venha-Ver",{"v":2414753,"d":"24.14.7.53"}]
[null,"RN","Vera Cruz","RN - Vera Cruz",{"v":2414803,"d":"24.14.8.03"}]
[null,"RN","Viçosa","RN - Viçosa",{"v":2414902,"d":"24.14.9.02"}]
[null,"RN","Vila Flor","RN - Vila Flor",{"v":2415008,"d":"24.15.0.08"}]
[null,"RO","Alta Floresta D'Oeste","RO - Alta Floresta D'Oeste",{"v":1100015,"d":"11.00.0.15"}]
[null,"RO","Alto Alegre dos Parecis","RO - Alto Alegre dos Parecis",{"v":1100379,"d":"11.00.3.79"}]
[null,"RO","Alto Paraíso","RO - Alto Paraíso",{"v":1100403,"d":"11.00.4.03"}]
[null,"RO","Alvorada D'Oeste","RO - Alvorada D'Oeste",{"v":1100346,"d":"11.00.3.46"}]
[null,"RO","Ariquemes","RO - Ariquemes",{"v":1100023,"d":"11.00.0.23"}]
[null,"RO","Buritis","RO - Buritis",{"v":1100452,"d":"11.00.4.52"}]
[null,"RO","Cabixi","RO - Cabixi",{"v":1100031,"d":"11.00.0.31"}]
[null,"RO","Cacaulândia","RO - Cacaulândia",{"v":1100601,"d":"11.00.6.01"}]
[null,"RO","Cacoal","RO - Cacoal",{"v":1100049,"d":"11.00.0.49"}]
[null,"RO","Campo Novo de Rondônia","RO - Campo Novo de Rondônia",{"v":1100700,"d":"11.00.7.00"}]
[null,"RO","Candeias do Jamari","RO - Candeias do Jamari",{"v":1100809,"d":"11.00.8.09"}]
[null,"RO","Castanheiras","RO - Castanheiras",{"v":1100908,"d":"11.00.9.08"}]
[null,"RO","Cerejeiras","RO - Cerejeiras",{"v":1100056,"d":"11.00.0.56"}]
[null,"RO","Chupinguaia","RO - Chupinguaia",{"v":1100924,"d":"11.00.9.24"}]
[null,"RO","Colorado do Oeste","RO - Colorado do Oeste",{"v":1100064,"d":"11.00.0.64"}]
[null,"RO","Corumbiara","RO - Corumbiara",{"v":1100072,"d":"11.00.0.72"}]
[null,"RO","Costa Marques","RO - Costa Marques",{"v":1100080,"d":"11.00.0.80"}]
[null,"RO","Cujubim","RO - Cujubim",{"v":1100940,"d":"11.00.9.40"}]
[null,"RO","Espigão D'Oeste","RO - Espigão D'Oeste",{"v":1100098,"d":"11.00.0.98"}]
[null,"RO","Governador Jorge Teixeira","RO - Governador Jorge Teixeira",{"v":1101005,"d":"11.01.0.05"}]
[null,"RO","Guajará-Mirim","RO - Guajará-Mirim",{"v":1100106,"d":"11.00.1.06"}]
[null,"RO","Itapuã do Oeste","RO - Itapuã do Oeste",{"v":1101104,"d":"11.01.1.04"}]
[null,"RO","Jaru","RO - Jaru",{"v":1100114,"d":"11.00.1.14"}]
[null,"RO","Ji-Paraná","RO - Ji-Paraná",{"v":1100122,"d":"11.00.1.22"}]
[null,"RO","Machadinho D'Oeste","RO - Machadinho D'Oeste",{"v":1100130,"d":"11.00.1.30"}]
[null,"RO","Ministro Andreazza","RO - Ministro Andreazza",{"v":1101203,"d":"11.01.2.03"}]
[null,"RO","Mirante da Serra","RO - Mirante da Serra",{"v":1101302,"d":"11.01.3.02"}]
[null,"RO","Monte Negro","RO - Monte Negro",{"v":1101401,"d":"11.01.4.01"}]
[null,"RO","Nova Brasilândia D'Oeste","RO - Nova Brasilândia D'Oeste",{"v":1100148,"d":"11.00.1.48"}]
[null,"RO","Nova Mamoré","RO - Nova Mamoré",{"v":1100338,"d":"11.00.3.38"}]
[null,"RO","Nova União","RO - Nova União",{"v":1101435,"d":"11.01.4.35"}]
[null,"RO","Novo Horizonte do Oeste","RO - Novo Horizonte do Oeste",{"v":1100502,"d":"11.00.5.02"}]
[null,"RO","Ouro Preto do Oeste","RO - Ouro Preto do Oeste",{"v":1100155,"d":"11.00.1.55"}]
[null,"RO","Parecis","RO - Parecis",{"v":1101450,"d":"11.01.4.50"}]
[null,"RO","Pimenta Bueno","RO - Pimenta Bueno",{"v":1100189,"d":"11.00.1.89"}]
[null,"RO","Pimenteiras do Oeste","RO - Pimenteiras do Oeste",{"v":1101468,"d":"11.01.4.68"}]
[null,"RO","Porto Velho","RO - Porto Velho",{"v":1100205,"d":"11.00.2.05"}]
[null,"RO","Presidente Médici","RO - Presidente Médici",{"v":1100254,"d":"11.00.2.54"}]
[null,"RO","Primavera de Rondônia","RO - Primavera de Rondônia",{"v":1101476,"d":"11.01.4.76"}]
[null,"RO","Rio Crespo","RO - Rio Crespo",{"v":1100262,"d":"11.00.2.62"}]
[null,"RO","Rolim de Moura","RO - Rolim de Moura",{"v":1100288,"d":"11.00.2.88"}]
[null,"RO","Santa Luzia D'Oeste","RO - Santa Luzia D'Oeste",{"v":1100296,"d":"11.00.2.96"}]
[null,"RO","São Felipe D'Oeste","RO - São Felipe D'Oeste",{"v":1101484,"d":"11.01.4.84"}]
[null,"RO","São Francisco do Guaporé","RO - São Francisco do Guaporé",{"v":1101492,"d":"11.01.4.92"}]
[null,"RO","São Miguel do Guaporé","RO - São Miguel do Guaporé",{"v":1100320,"d":"11.00.3.20"}]
[null,"RO","Seringueiras","RO - Seringueiras",{"v":1101500,"d":"11.01.5.00"}]
[null,"RO","Teixeirópolis","RO - Teixeirópolis",{"v":1101559,"d":"11.01.5.59"}]
[null,"RO","Theobroma","RO - Theobroma",{"v":1101609,"d":"11.01.6.09"}]
[null,"RO","Urupá","RO - Urupá",{"v":1101708,"d":"11.01.7.08"}]
[null,"RO","Vale do Anari","RO - Vale do Anari",{"v":1101757,"d":"11.01.7.57"}]
[null,"RO","Vale do Paraíso",{"$f":"CONCATENATE(B3935,\" - \",C3935)","v":"RO - Vale do Paraíso"},{"v":1101807,"d":"11.01.8.07"}]
[null,"RO","Vilhena","RO - Vilhena",{"v":1100304,"d":"11.00.3.04"}]
[null,"RR","Alto Alegre","RR - Alto Alegre",{"v":1400050,"d":"14.00.0.50"}]
[null,"RR","Amajari","RR - Amajari",{"v":1400027,"d":"14.00.0.27"}]
[null,"RR","Boa Vista","RR - Boa Vista",{"v":1400100,"d":"14.00.1.00"}]
[null,"RR","Bonfim","RR - Bonfim",{"v":1400159,"d":"14.00.1.59"}]
[null,"RR","Cantá","RR - Cantá",{"v":1400175,"d":"14.00.1.75"}]
[null,"RR","Caracaraí","RR - Caracaraí",{"v":1400209,"d":"14.00.2.09"}]
[null,"RR","Caroebe","RR - Caroebe",{"v":1400233,"d":"14.00.2.33"}]
[null,"RR","Iracema","RR - Iracema",{"v":1400282,"d":"14.00.2.82"}]
[null,"RR","Mucajaí","RR - Mucajaí",{"v":1400308,"d":"14.00.3.08"}]
[null,"RR","Normandia","RR - Normandia",{"v":1400407,"d":"14.00.4.07"}]
[null,"RR","Pacaraima","RR - Pacaraima",{"v":1400456,"d":"14.00.4.56"}]
[null,"RR","Rorainópolis","RR - Rorainópolis",{"v":1400472,"d":"14.00.4.72"}]
[null,"RR","São João da Baliza","RR - São João da Baliza",{"v":1400506,"d":"14.00.5.06"}]
[null,"RR","São Luiz","RR - São Luiz",{"v":1400605,"d":"14.00.6.05"}]
[null,"RR","Uiramutã","RR - Uiramutã",{"v":1400704,"d":"14.00.7.04"}]
[null,"RS","Aceguá","RS - Aceguá",{"v":4300034,"d":"43.00.0.34"}]
[null,"RS","Água Santa","RS - Água Santa",{"v":4300059,"d":"43.00.0.59"}]
[null,"RS","Agudo","RS - Agudo",{"v":4300109,"d":"43.00.1.09"}]
[null,"RS","Ajuricaba","RS - Ajuricaba",{"v":4300208,"d":"43.00.2.08"}]
[null,"RS","Alecrim","RS - Alecrim",{"v":4300307,"d":"43.00.3.07"}]
[null,"RS","Alegrete","RS - Alegrete",{"v":4300406,"d":"43.00.4.06"}]
[null,"RS","Alegria","RS - Alegria",{"v":4300455,"d":"43.00.4.55"}]
[null,"RS","Almirante Tamandaré do Sul","RS - Almirante Tamandaré do Sul",{"v":4300471,"d":"43.00.4.71"}]
[null,"RS","Alpestre","RS - Alpestre",{"v":4300505,"d":"43.00.5.05"}]
[null,"RS","Alto Alegre","RS - Alto Alegre",{"v":4300554,"d":"43.00.5.54"}]
[null,"RS","Alto Feliz","RS - Alto Feliz",{"v":4300570,"d":"43.00.5.70"}]
[null,"RS","Alvorada","RS - Alvorada",{"v":4300604,"d":"43.00.6.04"}]
[null,"RS","Amaral Ferrador","RS - Amaral Ferrador",{"v":4300638,"d":"43.00.6.38"}]
[null,"RS","Ametista do Sul","RS - Ametista do Sul",{"v":4300646,"d":"43.00.6.46"}]
[null,"RS","André da Rocha","RS - André da Rocha",{"v":4300661,"d":"43.00.6.61"}]
[null,"RS","Anta Gorda","RS - Anta Gorda",{"v":4300703,"d":"43.00.7.03"}]
[null,"RS","Antônio Prado","RS - Antônio Prado",{"v":4300802,"d":"43.00.8.02"}]
[null,"RS","Arambaré","RS - Arambaré",{"v":4300851,"d":"43.00.8.51"}]
[null,"RS","Araricá","RS - Araricá",{"v":4300877,"d":"43.00.8.77"}]
[null,"RS","Aratiba","RS - Aratiba",{"v":4300901,"d":"43.00.9.01"}]
[null,"RS","Arroio do Meio","RS - Arroio do Meio",{"v":4301008,"d":"43.01.0.08"}]
[null,"RS","Arroio do Padre","RS - Arroio do Padre",{"v":4301073,"d":"43.01.0.73"}]
[null,"RS","Arroio do Sal","RS - Arroio do Sal",{"v":4301057,"d":"43.01.0.57"}]
[null,"RS","Arroio do Tigre","RS - Arroio do Tigre",{"v":4301206,"d":"43.01.2.06"}]
[null,"RS","Arroio dos Ratos","RS - Arroio dos Ratos",{"v":4301107,"d":"43.01.1.07"}]
[null,"RS","Arroio Grande","RS - Arroio Grande",{"v":4301305,"d":"43.01.3.05"}]
[null,"RS","Arvorezinha","RS - Arvorezinha",{"v":4301404,"d":"43.01.4.04"}]
[null,"RS","Augusto Pestana","RS - Augusto Pestana",{"v":4301503,"d":"43.01.5.03"}]
[null,"RS","Áurea","RS - Áurea",{"v":4301552,"d":"43.01.5.52"}]
[null,"RS","Bagé","RS - Bagé",{"v":4301602,"d":"43.01.6.02"}]
[null,"RS","Balneário Pinhal","RS - Balneário Pinhal",{"v":4301636,"d":"43.01.6.36"}]
[null,"RS","Barão","RS - Barão",{"v":4301651,"d":"43.01.6.51"}]
[null,"RS","Barão de Cotegipe","RS - Barão de Cotegipe",{"v":4301701,"d":"43.01.7.01"}]
[null,"RS","Barão do Triunfo","RS - Barão do Triunfo",{"v":4301750,"d":"43.01.7.50"}]
[null,"RS","Barra do Guarita","RS - Barra do Guarita",{"v":4301859,"d":"43.01.8.59"}]
[null,"RS","Barra do Quaraí","RS - Barra do Quaraí",{"v":4301875,"d":"43.01.8.75"}]
[null,"RS","Barra do Ribeiro","RS - Barra do Ribeiro",{"v":4301909,"d":"43.01.9.09"}]
[null,"RS","Barra do Rio Azul","RS - Barra do Rio Azul",{"v":4301925,"d":"43.01.9.25"}]
[null,"RS","Barra Funda","RS - Barra Funda",{"v":4301958,"d":"43.01.9.58"}]
[null,"RS","Barracão","RS - Barracão",{"v":4301800,"d":"43.01.8.00"}]
[null,"RS","Barros Cassal","RS - Barros Cassal",{"v":4302006,"d":"43.02.0.06"}]
[null,"RS","Benjamin Constant do Sul","RS - Benjamin Constant do Sul",{"v":4302055,"d":"43.02.0.55"}]
[null,"RS","Bento Gonçalves","RS - Bento Gonçalves",{"v":4302105,"d":"43.02.1.05"}]
[null,"RS","Boa Vista das Missões","RS - Boa Vista das Missões",{"v":4302154,"d":"43.02.1.54"}]
[null,"RS","Boa Vista do Buricá","RS - Boa Vista do Buricá",{"v":4302204,"d":"43.02.2.04"}]
[null,"RS","Boa Vista do Cadeado","RS - Boa Vista do Cadeado",{"v":4302220,"d":"43.02.2.20"}]
[null,"RS","Boa Vista do Incra","RS - Boa Vista do Incra",{"v":4302238,"d":"43.02.2.38"}]
[null,"RS","Boa Vista do Sul",{"$f":"CONCATENATE(B3999,\" - \",C3999)","v":"RS - Boa Vista do Sul"},{"v":4302253,"d":"43.02.2.53"}]
[null,"RS","Bom Jesus","RS - Bom Jesus",{"v":4302303,"d":"43.02.3.03"}]
[null,"RS","Bom Princípio","RS - Bom Princípio",{"v":4302352,"d":"43.02.3.52"}]
[null,"RS","Bom Progresso","RS - Bom Progresso",{"v":4302378,"d":"43.02.3.78"}]
[null,"RS","Bom Retiro do Sul","RS - Bom Retiro do Sul",{"v":4302402,"d":"43.02.4.02"}]
[null,"RS","Boqueirão do Leão","RS - Boqueirão do Leão",{"v":4302451,"d":"43.02.4.51"}]
[null,"RS","Bossoroca","RS - Bossoroca",{"v":4302501,"d":"43.02.5.01"}]
[null,"RS","Bozano","RS - Bozano",{"v":4302584,"d":"43.02.5.84"}]
[null,"RS","Braga","RS - Braga",{"v":4302600,"d":"43.02.6.00"}]
[null,"RS","Brochier","RS - Brochier",{"v":4302659,"d":"43.02.6.59"}]
[null,"RS","Butiá","RS - Butiá",{"v":4302709,"d":"43.02.7.09"}]
[null,"RS","Caçapava do Sul","RS - Caçapava do Sul",{"v":4302808,"d":"43.02.8.08"}]
[null,"RS","Cacequi","RS - Cacequi",{"v":4302907,"d":"43.02.9.07"}]
[null,"RS","Cachoeira do Sul","RS - Cachoeira do Sul",{"v":4303004,"d":"43.03.0.04"}]
[null,"RS","Cachoeirinha","RS - Cachoeirinha",{"v":4303103,"d":"43.03.1.03"}]
[null,"RS","Cacique Doble","RS - Cacique Doble",{"v":4303202,"d":"43.03.2.02"}]
[null,"RS","Caibaté","RS - Caibaté",{"v":4303301,"d":"43.03.3.01"}]
[null,"RS","Caiçara","RS - Caiçara",{"v":4303400,"d":"43.03.4.00"}]
[null,"RS","Camaquã","RS - Camaquã",{"v":4303509,"d":"43.03.5.09"}]
[null,"RS","Camargo","RS - Camargo",{"v":4303558,"d":"43.03.5.58"}]
[null,"RS","Cambará do Sul","RS - Cambará do Sul",{"v":4303608,"d":"43.03.6.08"}]
[null,"RS","Campestre da Serra","RS - Campestre da Serra",{"v":4303673,"d":"43.03.6.73"}]
[null,"RS","Campina das Missões","RS - Campina das Missões",{"v":4303707,"d":"43.03.7.07"}]
[null,"RS","Campinas do Sul","RS - Campinas do Sul",{"v":4303806,"d":"43.03.8.06"}]
[null,"RS","Campo Bom","RS - Campo Bom",{"v":4303905,"d":"43.03.9.05"}]
[null,"RS","Campo Novo","RS - Campo Novo",{"v":4304002,"d":"43.04.0.02"}]
[null,"RS","Campos Borges","RS - Campos Borges",{"v":4304101,"d":"43.04.1.01"}]
[null,"RS","Candelária","RS - Candelária",{"v":4304200,"d":"43.04.2.00"}]
[null,"RS","Cândido Godói","RS - Cândido Godói",{"v":4304309,"d":"43.04.3.09"}]
[null,"RS","Candiota","RS - Candiota",{"v":4304358,"d":"43.04.3.58"}]
[null,"RS","Canela","RS - Canela",{"v":4304408,"d":"43.04.4.08"}]
[null,"RS","Canguçu","RS - Canguçu",{"v":4304507,"d":"43.04.5.07"}]
[null,"RS","Canoas","RS - Canoas",{"v":4304606,"d":"43.04.6.06"}]
[null,"RS","Canudos do Vale","RS - Canudos do Vale",{"v":4304614,"d":"43.04.6.14"}]
[null,"RS","Capão Bonito do Sul","RS - Capão Bonito do Sul",{"v":4304622,"d":"43.04.6.22"}]
[null,"RS","Capão da Canoa","RS - Capão da Canoa",{"v":4304630,"d":"43.04.6.30"}]
[null,"RS","Capão do Cipó","RS - Capão do Cipó",{"v":4304655,"d":"43.04.6.55"}]
[null,"RS","Capão do Leão","RS - Capão do Leão",{"v":4304663,"d":"43.04.6.63"}]
[null,"RS","Capela de Santana","RS - Capela de Santana",{"v":4304689,"d":"43.04.6.89"}]
[null,"RS","Capitão","RS - Capitão",{"v":4304697,"d":"43.04.6.97"}]
[null,"RS","Capivari do Sul","RS - Capivari do Sul",{"v":4304671,"d":"43.04.6.71"}]
[null,"RS","Caraá","RS - Caraá",{"v":4304713,"d":"43.04.7.13"}]
[null,"RS","Carazinho","RS - Carazinho",{"v":4304705,"d":"43.04.7.05"}]
[null,"RS","Carlos Barbosa","RS - Carlos Barbosa",{"v":4304804,"d":"43.04.8.04"}]
[null,"RS","Carlos Gomes","RS - Carlos Gomes",{"v":4304853,"d":"43.04.8.53"}]
[null,"RS","Casca","RS - Casca",{"v":4304903,"d":"43.04.9.03"}]
[null,"RS","Caseiros","RS - Caseiros",{"v":4304952,"d":"43.04.9.52"}]
[null,"RS","Catuípe","RS - Catuípe",{"v":4305009,"d":"43.05.0.09"}]
[null,"RS","Caxias do Sul","RS - Caxias do Sul",{"v":4305108,"d":"43.05.1.08"}]
[null,"RS","Centenário","RS - Centenário",{"v":4305116,"d":"43.05.1.16"}]
[null,"RS","Cerrito","RS - Cerrito",{"v":4305124,"d":"43.05.1.24"}]
[null,"RS","Cerro Branco","RS - Cerro Branco",{"v":4305132,"d":"43.05.1.32"}]
[null,"RS","Cerro Grande","RS - Cerro Grande",{"v":4305157,"d":"43.05.1.57"}]
[null,"RS","Cerro Grande do Sul","RS - Cerro Grande do Sul",{"v":4305173,"d":"43.05.1.73"}]
[null,"RS","Cerro Largo","RS - Cerro Largo",{"v":4305207,"d":"43.05.2.07"}]
[null,"RS","Chapada","RS - Chapada",{"v":4305306,"d":"43.05.3.06"}]
[null,"RS","Charqueadas","RS - Charqueadas",{"v":4305355,"d":"43.05.3.55"}]
[null,"RS","Charrua","RS - Charrua",{"v":4305371,"d":"43.05.3.71"}]
[null,"RS","Chiapetta","RS - Chiapetta",{"v":4305405,"d":"43.05.4.05"}]
[null,"RS","Chuí","RS - Chuí",{"v":4305439,"d":"43.05.4.39"}]
[null,"RS","Chuvisca","RS - Chuvisca",{"v":4305447,"d":"43.05.4.47"}]
[null,"RS","Cidreira","RS - Cidreira",{"v":4305454,"d":"43.05.4.54"}]
[null,"RS","Ciríaco","RS - Ciríaco",{"v":4305504,"d":"43.05.5.04"}]
[null,"RS","Colinas","RS - Colinas",{"v":4305587,"d":"43.05.5.87"}]
[null,"RS","Colorado",{"$f":"CONCATENATE(B4063,\" - \",C4063)","v":"RS - Colorado"},{"v":4305603,"d":"43.05.6.03"}]
[null,"RS","Condor","RS - Condor",{"v":4305702,"d":"43.05.7.02"}]
[null,"RS","Constantina","RS - Constantina",{"v":4305801,"d":"43.05.8.01"}]
[null,"RS","Coqueiro Baixo","RS - Coqueiro Baixo",{"v":4305835,"d":"43.05.8.35"}]
[null,"RS","Coqueiros do Sul","RS - Coqueiros do Sul",{"v":4305850,"d":"43.05.8.50"}]
[null,"RS","Coronel Barros","RS - Coronel Barros",{"v":4305871,"d":"43.05.8.71"}]
[null,"RS","Coronel Bicaco","RS - Coronel Bicaco",{"v":4305900,"d":"43.05.9.00"}]
[null,"RS","Coronel Pilar","RS - Coronel Pilar",{"v":4305934,"d":"43.05.9.34"}]
[null,"RS","Cotiporã","RS - Cotiporã",{"v":4305959,"d":"43.05.9.59"}]
[null,"RS","Coxilha","RS - Coxilha",{"v":4305975,"d":"43.05.9.75"}]
[null,"RS","Crissiumal","RS - Crissiumal",{"v":4306007,"d":"43.06.0.07"}]
[null,"RS","Cristal","RS - Cristal",{"v":4306056,"d":"43.06.0.56"}]
[null,"RS","Cristal do Sul","RS - Cristal do Sul",{"v":4306072,"d":"43.06.0.72"}]
[null,"RS","Cruz Alta","RS - Cruz Alta",{"v":4306106,"d":"43.06.1.06"}]
[null,"RS","Cruzaltense","RS - Cruzaltense",{"v":4306130,"d":"43.06.1.30"}]
[null,"RS","Cruzeiro do Sul","RS - Cruzeiro do Sul",{"v":4306205,"d":"43.06.2.05"}]
[null,"RS","David Canabarro","RS - David Canabarro",{"v":4306304,"d":"43.06.3.04"}]
[null,"RS","Derrubadas","RS - Derrubadas",{"v":4306320,"d":"43.06.3.20"}]
[null,"RS","Dezesseis de Novembro","RS - Dezesseis de Novembro",{"v":4306353,"d":"43.06.3.53"}]
[null,"RS","Dilermando de Aguiar","RS - Dilermando de Aguiar",{"v":4306379,"d":"43.06.3.79"}]
[null,"RS","Dois Irmãos","RS - Dois Irmãos",{"v":4306403,"d":"43.06.4.03"}]
[null,"RS","Dois Irmãos das Missões","RS - Dois Irmãos das Missões",{"v":4306429,"d":"43.06.4.29"}]
[null,"RS","Dois Lajeados","RS - Dois Lajeados",{"v":4306452,"d":"43.06.4.52"}]
[null,"RS","Dom Feliciano","RS - Dom Feliciano",{"v":4306502,"d":"43.06.5.02"}]
[null,"RS","Dom Pedrito","RS - Dom Pedrito",{"v":4306601,"d":"43.06.6.01"}]
[null,"RS","Dom Pedro de Alcântara","RS - Dom Pedro de Alcântara",{"v":4306551,"d":"43.06.5.51"}]
[null,"RS","Dona Francisca","RS - Dona Francisca",{"v":4306700,"d":"43.06.7.00"}]
[null,"RS","Doutor Maurício Cardoso","RS - Doutor Maurício Cardoso",{"v":4306734,"d":"43.06.7.34"}]
[null,"RS","Doutor Ricardo","RS - Doutor Ricardo",{"v":4306759,"d":"43.06.7.59"}]
[null,"RS","Eldorado do Sul","RS - Eldorado do Sul",{"v":4306767,"d":"43.06.7.67"}]
[null,"RS","Encantado","RS - Encantado",{"v":4306809,"d":"43.06.8.09"}]
[null,"RS","Encruzilhada do Sul","RS - Encruzilhada do Sul",{"v":4306908,"d":"43.06.9.08"}]
[null,"RS","Engenho Velho","RS - Engenho Velho",{"v":4306924,"d":"43.06.9.24"}]
[null,"RS","Entre Rios do Sul","RS - Entre Rios do Sul",{"v":4306957,"d":"43.06.9.57"}]
[null,"RS","Entre-Ijuís","RS - Entre-Ijuís",{"v":4306932,"d":"43.06.9.32"}]
[null,"RS","Erebango","RS - Erebango",{"v":4306973,"d":"43.06.9.73"}]
[null,"RS","Erechim","RS - Erechim",{"v":4307005,"d":"43.07.0.05"}]
[null,"RS","Ernestina","RS - Ernestina",{"v":4307054,"d":"43.07.0.54"}]
[null,"RS","Erval Grande","RS - Erval Grande",{"v":4307203,"d":"43.07.2.03"}]
[null,"RS","Erval Seco","RS - Erval Seco",{"v":4307302,"d":"43.07.3.02"}]
[null,"RS","Esmeralda","RS - Esmeralda",{"v":4307401,"d":"43.07.4.01"}]
[null,"RS","Esperança do Sul","RS - Esperança do Sul",{"v":4307450,"d":"43.07.4.50"}]
[null,"RS","Espumoso","RS - Espumoso",{"v":4307500,"d":"43.07.5.00"}]
[null,"RS","Estação","RS - Estação",{"v":4307559,"d":"43.07.5.59"}]
[null,"RS","Estância Velha","RS - Estância Velha",{"v":4307609,"d":"43.07.6.09"}]
[null,"RS","Esteio","RS - Esteio",{"v":4307708,"d":"43.07.7.08"}]
[null,"RS","Estrela","RS - Estrela",{"v":4307807,"d":"43.07.8.07"}]
[null,"RS","Estrela Velha","RS - Estrela Velha",{"v":4307815,"d":"43.07.8.15"}]
[null,"RS","Eugênio de Castro","RS - Eugênio de Castro",{"v":4307831,"d":"43.07.8.31"}]
[null,"RS","Fagundes Varela","RS - Fagundes Varela",{"v":4307864,"d":"43.07.8.64"}]
[null,"RS","Farroupilha","RS - Farroupilha",{"v":4307906,"d":"43.07.9.06"}]
[null,"RS","Faxinal do Soturno","RS - Faxinal do Soturno",{"v":4308003,"d":"43.08.0.03"}]
[null,"RS","Faxinalzinho","RS - Faxinalzinho",{"v":4308052,"d":"43.08.0.52"}]
[null,"RS","Fazenda Vilanova","RS - Fazenda Vilanova",{"v":4308078,"d":"43.08.0.78"}]
[null,"RS","Feliz","RS - Feliz",{"v":4308102,"d":"43.08.1.02"}]
[null,"RS","Flores da Cunha","RS - Flores da Cunha",{"v":4308201,"d":"43.08.2.01"}]
[null,"RS","Floriano Peixoto","RS - Floriano Peixoto",{"v":4308250,"d":"43.08.2.50"}]
[null,"RS","Fontoura Xavier","RS - Fontoura Xavier",{"v":4308300,"d":"43.08.3.00"}]
[null,"RS","Formigueiro","RS - Formigueiro",{"v":4308409,"d":"43.08.4.09"}]
[null,"RS","Forquetinha","RS - Forquetinha",{"v":4308433,"d":"43.08.4.33"}]
[null,"RS","Fortaleza dos Valos","RS - Fortaleza dos Valos",{"v":4308458,"d":"43.08.4.58"}]
[null,"RS","Frederico Westphalen","RS - Frederico Westphalen",{"v":4308508,"d":"43.08.5.08"}]
[null,"RS","Garibaldi","RS - Garibaldi",{"v":4308607,"d":"43.08.6.07"}]
[null,"RS","Garruchos","RS - Garruchos",{"v":4308656,"d":"43.08.6.56"}]
[null,"RS","Gaurama",{"$f":"CONCATENATE(B4127,\" - \",C4127)","v":"RS - Gaurama"},{"v":4308706,"d":"43.08.7.06"}]
[null,"RS","General Câmara","RS - General Câmara",{"v":4308805,"d":"43.08.8.05"}]
[null,"RS","Gentil","RS - Gentil",{"v":4308854,"d":"43.08.8.54"}]
[null,"RS","Getúlio Vargas","RS - Getúlio Vargas",{"v":4308904,"d":"43.08.9.04"}]
[null,"RS","Giruá","RS - Giruá",{"v":4309001,"d":"43.09.0.01"}]
[null,"RS","Glorinha","RS - Glorinha",{"v":4309050,"d":"43.09.0.50"}]
[null,"RS","Gramado","RS - Gramado",{"v":4309100,"d":"43.09.1.00"}]
[null,"RS","Gramado dos Loureiros","RS - Gramado dos Loureiros",{"v":4309126,"d":"43.09.1.26"}]
[null,"RS","Gramado Xavier","RS - Gramado Xavier",{"v":4309159,"d":"43.09.1.59"}]
[null,"RS","Gravataí","RS - Gravataí",{"v":4309209,"d":"43.09.2.09"}]
[null,"RS","Guabiju","RS - Guabiju",{"v":4309258,"d":"43.09.2.58"}]
[null,"RS","Guaíba","RS - Guaíba",{"v":4309308,"d":"43.09.3.08"}]
[null,"RS","Guaporé","RS - Guaporé",{"v":4309407,"d":"43.09.4.07"}]
[null,"RS","Guarani das Missões","RS - Guarani das Missões",{"v":4309506,"d":"43.09.5.06"}]
[null,"RS","Harmonia","RS - Harmonia",{"v":4309555,"d":"43.09.5.55"}]
[null,"RS","Herval","RS - Herval",{"v":4307104,"d":"43.07.1.04"}]
[null,"RS","Herveiras","RS - Herveiras",{"v":4309571,"d":"43.09.5.71"}]
[null,"RS","Horizontina","RS - Horizontina",{"v":4309605,"d":"43.09.6.05"}]
[null,"RS","Hulha Negra","RS - Hulha Negra",{"v":4309654,"d":"43.09.6.54"}]
[null,"RS","Humaitá","RS - Humaitá",{"v":4309704,"d":"43.09.7.04"}]
[null,"RS","Ibarama","RS - Ibarama",{"v":4309753,"d":"43.09.7.53"}]
[null,"RS","Ibiaçá","RS - Ibiaçá",{"v":4309803,"d":"43.09.8.03"}]
[null,"RS","Ibiraiaras","RS - Ibiraiaras",{"v":4309902,"d":"43.09.9.02"}]
[null,"RS","Ibirapuitã","RS - Ibirapuitã",{"v":4309951,"d":"43.09.9.51"}]
[null,"RS","Ibirubá","RS - Ibirubá",{"v":4310009,"d":"43.10.0.09"}]
[null,"RS","Igrejinha","RS - Igrejinha",{"v":4310108,"d":"43.10.1.08"}]
[null,"RS","Ijuí","RS - Ijuí",{"v":4310207,"d":"43.10.2.07"}]
[null,"RS","Ilópolis","RS - Ilópolis",{"v":4310306,"d":"43.10.3.06"}]
[null,"RS","Imbé","RS - Imbé",{"v":4310330,"d":"43.10.3.30"}]
[null,"RS","Imigrante","RS - Imigrante",{"v":4310363,"d":"43.10.3.63"}]
[null,"RS","Independência","RS - Independência",{"v":4310405,"d":"43.10.4.05"}]
[null,"RS","Inhacorá","RS - Inhacorá",{"v":4310413,"d":"43.10.4.13"}]
[null,"RS","Ipê","RS - Ipê",{"v":4310439,"d":"43.10.4.39"}]
[null,"RS","Ipiranga do Sul","RS - Ipiranga do Sul",{"v":4310462,"d":"43.10.4.62"}]
[null,"RS","Iraí","RS - Iraí",{"v":4310504,"d":"43.10.5.04"}]
[null,"RS","Itaara","RS - Itaara",{"v":4310538,"d":"43.10.5.38"}]
[null,"RS","Itacurubi","RS - Itacurubi",{"v":4310553,"d":"43.10.5.53"}]
[null,"RS","Itapuca","RS - Itapuca",{"v":4310579,"d":"43.10.5.79"}]
[null,"RS","Itaqui","RS - Itaqui",{"v":4310603,"d":"43.10.6.03"}]
[null,"RS","Itati","RS - Itati",{"v":4310652,"d":"43.10.6.52"}]
[null,"RS","Itatiba do Sul","RS - Itatiba do Sul",{"v":4310702,"d":"43.10.7.02"}]
[null,"RS","Ivorá","RS - Ivorá",{"v":4310751,"d":"43.10.7.51"}]
[null,"RS","Ivoti","RS - Ivoti",{"v":4310801,"d":"43.10.8.01"}]
[null,"RS","Jaboticaba","RS - Jaboticaba",{"v":4310850,"d":"43.10.8.50"}]
[null,"RS","Jacuizinho","RS - Jacuizinho",{"v":4310876,"d":"43.10.8.76"}]
[null,"RS","Jacutinga","RS - Jacutinga",{"v":4310900,"d":"43.10.9.00"}]
[null,"RS","Jaguarão","RS - Jaguarão",{"v":4311007,"d":"43.11.0.07"}]
[null,"RS","Jaguari","RS - Jaguari",{"v":4311106,"d":"43.11.1.06"}]
[null,"RS","Jaquirana","RS - Jaquirana",{"v":4311122,"d":"43.11.1.22"}]
[null,"RS","Jari","RS - Jari",{"v":4311130,"d":"43.11.1.30"}]
[null,"RS","Jóia","RS - Jóia",{"v":4311155,"d":"43.11.1.55"}]
[null,"RS","Júlio de Castilhos","RS - Júlio de Castilhos",{"v":4311205,"d":"43.11.2.05"}]
[null,"RS","Lagoa Bonita do Sul","RS - Lagoa Bonita do Sul",{"v":4311239,"d":"43.11.2.39"}]
[null,"RS","Lagoa dos Três Cantos","RS - Lagoa dos Três Cantos",{"v":4311270,"d":"43.11.2.70"}]
[null,"RS","Lagoa Vermelha","RS - Lagoa Vermelha",{"v":4311304,"d":"43.11.3.04"}]
[null,"RS","Lagoão","RS - Lagoão",{"v":4311254,"d":"43.11.2.54"}]
[null,"RS","Lajeado","RS - Lajeado",{"v":4311403,"d":"43.11.4.03"}]
[null,"RS","Lajeado do Bugre","RS - Lajeado do Bugre",{"v":4311429,"d":"43.11.4.29"}]
[null,"RS","Lavras do Sul","RS - Lavras do Sul",{"v":4311502,"d":"43.11.5.02"}]
[null,"RS","Liberato Salzano","RS - Liberato Salzano",{"v":4311601,"d":"43.11.6.01"}]
[null,"RS","Lindolfo Collor","RS - Lindolfo Collor",{"v":4311627,"d":"43.11.6.27"}]
[null,"RS","Linha Nova","RS - Linha Nova",{"v":4311643,"d":"43.11.6.43"}]
[null,"RS","Maçambará","RS - Maçambará",{"v":4311718,"d":"43.11.7.18"}]
[null,"RS","Machadinho","RS - Machadinho",{"v":4311700,"d":"43.11.7.00"}]
[null,"RS","Mampituba",{"$f":"CONCATENATE(B4191,\" - \",C4191)","v":"RS - Mampituba"},{"v":4311734,"d":"43.11.7.34"}]
[null,"RS","Manoel Viana","RS - Manoel Viana",{"v":4311759,"d":"43.11.7.59"}]
[null,"RS","Maquiné","RS - Maquiné",{"v":4311775,"d":"43.11.7.75"}]
[null,"RS","Maratá","RS - Maratá",{"v":4311791,"d":"43.11.7.91"}]
[null,"RS","Marau","RS - Marau",{"v":4311809,"d":"43.11.8.09"}]
[null,"RS","Marcelino Ramos","RS - Marcelino Ramos",{"v":4311908,"d":"43.11.9.08"}]
[null,"RS","Mariana Pimentel","RS - Mariana Pimentel",{"v":4311981,"d":"43.11.9.81"}]
[null,"RS","Mariano Moro","RS - Mariano Moro",{"v":4312005,"d":"43.12.0.05"}]
[null,"RS","Marques de Souza","RS - Marques de Souza",{"v":4312054,"d":"43.12.0.54"}]
[null,"RS","Mata","RS - Mata",{"v":4312104,"d":"43.12.1.04"}]
[null,"RS","Mato Castelhano","RS - Mato Castelhano",{"v":4312138,"d":"43.12.1.38"}]
[null,"RS","Mato Leitão","RS - Mato Leitão",{"v":4312153,"d":"43.12.1.53"}]
[null,"RS","Mato Queimado","RS - Mato Queimado",{"v":4312179,"d":"43.12.1.79"}]
[null,"RS","Maximiliano de Almeida","RS - Maximiliano de Almeida",{"v":4312203,"d":"43.12.2.03"}]
[null,"RS","Minas do Leão","RS - Minas do Leão",{"v":4312252,"d":"43.12.2.52"}]
[null,"RS","Miraguaí","RS - Miraguaí",{"v":4312302,"d":"43.12.3.02"}]
[null,"RS","Montauri","RS - Montauri",{"v":4312351,"d":"43.12.3.51"}]
[null,"RS","Monte Alegre dos Campos","RS - Monte Alegre dos Campos",{"v":4312377,"d":"43.12.3.77"}]
[null,"RS","Monte Belo do Sul","RS - Monte Belo do Sul",{"v":4312385,"d":"43.12.3.85"}]
[null,"RS","Montenegro","RS - Montenegro",{"v":4312401,"d":"43.12.4.01"}]
[null,"RS","Mormaço","RS - Mormaço",{"v":4312427,"d":"43.12.4.27"}]
[null,"RS","Morrinhos do Sul","RS - Morrinhos do Sul",{"v":4312443,"d":"43.12.4.43"}]
[null,"RS","Morro Redondo","RS - Morro Redondo",{"v":4312450,"d":"43.12.4.50"}]
[null,"RS","Morro Reuter","RS - Morro Reuter",{"v":4312476,"d":"43.12.4.76"}]
[null,"RS","Mostardas","RS - Mostardas",{"v":4312500,"d":"43.12.5.00"}]
[null,"RS","Muçum","RS - Muçum",{"v":4312609,"d":"43.12.6.09"}]
[null,"RS","Muitos Capões","RS - Muitos Capões",{"v":4312617,"d":"43.12.6.17"}]
[null,"RS","Muliterno","RS - Muliterno",{"v":4312625,"d":"43.12.6.25"}]
[null,"RS","Não-Me-Toque","RS - Não-Me-Toque",{"v":4312658,"d":"43.12.6.58"}]
[null,"RS","Nicolau Vergueiro","RS - Nicolau Vergueiro",{"v":4312674,"d":"43.12.6.74"}]
[null,"RS","Nonoai","RS - Nonoai",{"v":4312708,"d":"43.12.7.08"}]
[null,"RS","Nova Alvorada","RS - Nova Alvorada",{"v":4312757,"d":"43.12.7.57"}]
[null,"RS","Nova Araçá","RS - Nova Araçá",{"v":4312807,"d":"43.12.8.07"}]
[null,"RS","Nova Bassano","RS - Nova Bassano",{"v":4312906,"d":"43.12.9.06"}]
[null,"RS","Nova Boa Vista","RS - Nova Boa Vista",{"v":4312955,"d":"43.12.9.55"}]
[null,"RS","Nova Bréscia","RS - Nova Bréscia",{"v":4313003,"d":"43.13.0.03"}]
[null,"RS","Nova Candelária","RS - Nova Candelária",{"v":4313011,"d":"43.13.0.11"}]
[null,"RS","Nova Esperança do Sul","RS - Nova Esperança do Sul",{"v":4313037,"d":"43.13.0.37"}]
[null,"RS","Nova Hartz","RS - Nova Hartz",{"v":4313060,"d":"43.13.0.60"}]
[null,"RS","Nova Pádua","RS - Nova Pádua",{"v":4313086,"d":"43.13.0.86"}]
[null,"RS","Nova Palma","RS - Nova Palma",{"v":4313102,"d":"43.13.1.02"}]
[null,"RS","Nova Petrópolis","RS - Nova Petrópolis",{"v":4313201,"d":"43.13.2.01"}]
[null,"RS","Nova Prata","RS - Nova Prata",{"v":4313300,"d":"43.13.3.00"}]
[null,"RS","Nova Ramada","RS - Nova Ramada",{"v":4313334,"d":"43.13.3.34"}]
[null,"RS","Nova Roma do Sul","RS - Nova Roma do Sul",{"v":4313359,"d":"43.13.3.59"}]
[null,"RS","Nova Santa Rita","RS - Nova Santa Rita",{"v":4313375,"d":"43.13.3.75"}]
[null,"RS","Novo Barreiro","RS - Novo Barreiro",{"v":4313490,"d":"43.13.4.90"}]
[null,"RS","Novo Cabrais","RS - Novo Cabrais",{"v":4313391,"d":"43.13.3.91"}]
[null,"RS","Novo Hamburgo","RS - Novo Hamburgo",{"v":4313409,"d":"43.13.4.09"}]
[null,"RS","Novo Machado","RS - Novo Machado",{"v":4313425,"d":"43.13.4.25"}]
[null,"RS","Novo Tiradentes","RS - Novo Tiradentes",{"v":4313441,"d":"43.13.4.41"}]
[null,"RS","Novo Xingu","RS - Novo Xingu",{"v":4313466,"d":"43.13.4.66"}]
[null,"RS","Osório","RS - Osório",{"v":4313508,"d":"43.13.5.08"}]
[null,"RS","Paim Filho","RS - Paim Filho",{"v":4313607,"d":"43.13.6.07"}]
[null,"RS","Palmares do Sul","RS - Palmares do Sul",{"v":4313656,"d":"43.13.6.56"}]
[null,"RS","Palmeira das Missões","RS - Palmeira das Missões",{"v":4313706,"d":"43.13.7.06"}]
[null,"RS","Palmitinho","RS - Palmitinho",{"v":4313805,"d":"43.13.8.05"}]
[null,"RS","Panambi","RS - Panambi",{"v":4313904,"d":"43.13.9.04"}]
[null,"RS","Pantano Grande","RS - Pantano Grande",{"v":4313953,"d":"43.13.9.53"}]
[null,"RS","Paraí","RS - Paraí",{"v":4314001,"d":"43.14.0.01"}]
[null,"RS","Paraíso do Sul","RS - Paraíso do Sul",{"v":4314027,"d":"43.14.0.27"}]
[null,"RS","Pareci Novo","RS - Pareci Novo",{"v":4314035,"d":"43.14.0.35"}]
[null,"RS","Parobé","RS - Parobé",{"v":4314050,"d":"43.14.0.50"}]
[null,"RS","Passa Sete","RS - Passa Sete",{"v":4314068,"d":"43.14.0.68"}]
[null,"RS","Passo do Sobrado",{"$f":"CONCATENATE(B4255,\" - \",C4255)","v":"RS - Passo do Sobrado"},{"v":4314076,"d":"43.14.0.76"}]
[null,"RS","Passo Fundo","RS - Passo Fundo",{"v":4314100,"d":"43.14.1.00"}]
[null,"RS","Paulo Bento","RS - Paulo Bento",{"v":4314134,"d":"43.14.1.34"}]
[null,"RS","Paverama","RS - Paverama",{"v":4314159,"d":"43.14.1.59"}]
[null,"RS","Pedras Altas","RS - Pedras Altas",{"v":4314175,"d":"43.14.1.75"}]
[null,"RS","Pedro Osório","RS - Pedro Osório",{"v":4314209,"d":"43.14.2.09"}]
[null,"RS","Pejuçara","RS - Pejuçara",{"v":4314308,"d":"43.14.3.08"}]
[null,"RS","Pelotas","RS - Pelotas",{"v":4314407,"d":"43.14.4.07"}]
[null,"RS","Picada Café","RS - Picada Café",{"v":4314423,"d":"43.14.4.23"}]
[null,"RS","Pinhal","RS - Pinhal",{"v":4314456,"d":"43.14.4.56"}]
[null,"RS","Pinhal da Serra","RS - Pinhal da Serra",{"v":4314464,"d":"43.14.4.64"}]
[null,"RS","Pinhal Grande","RS - Pinhal Grande",{"v":4314472,"d":"43.14.4.72"}]
[null,"RS","Pinheirinho do Vale","RS - Pinheirinho do Vale",{"v":4314498,"d":"43.14.4.98"}]
[null,"RS","Pinheiro Machado","RS - Pinheiro Machado",{"v":4314506,"d":"43.14.5.06"}]
[null,"RS","Pirapó","RS - Pirapó",{"v":4314555,"d":"43.14.5.55"}]
[null,"RS","Piratini","RS - Piratini",{"v":4314605,"d":"43.14.6.05"}]
[null,"RS","Planalto","RS - Planalto",{"v":4314704,"d":"43.14.7.04"}]
[null,"RS","Poço das Antas","RS - Poço das Antas",{"v":4314753,"d":"43.14.7.53"}]
[null,"RS","Pontão","RS - Pontão",{"v":4314779,"d":"43.14.7.79"}]
[null,"RS","Ponte Preta","RS - Ponte Preta",{"v":4314787,"d":"43.14.7.87"}]
[null,"RS","Portão","RS - Portão",{"v":4314803,"d":"43.14.8.03"}]
[null,"RS","Porto Alegre","RS - Porto Alegre",{"v":4314902,"d":"43.14.9.02"}]
[null,"RS","Porto Lucena","RS - Porto Lucena",{"v":4315008,"d":"43.15.0.08"}]
[null,"RS","Porto Mauá","RS - Porto Mauá",{"v":4315057,"d":"43.15.0.57"}]
[null,"RS","Porto Vera Cruz","RS - Porto Vera Cruz",{"v":4315073,"d":"43.15.0.73"}]
[null,"RS","Porto Xavier","RS - Porto Xavier",{"v":4315107,"d":"43.15.1.07"}]
[null,"RS","Pouso Novo","RS - Pouso Novo",{"v":4315131,"d":"43.15.1.31"}]
[null,"RS","Presidente Lucena","RS - Presidente Lucena",{"v":4315149,"d":"43.15.1.49"}]
[null,"RS","Progresso","RS - Progresso",{"v":4315156,"d":"43.15.1.56"}]
[null,"RS","Protásio Alves","RS - Protásio Alves",{"v":4315172,"d":"43.15.1.72"}]
[null,"RS","Putinga","RS - Putinga",{"v":4315206,"d":"43.15.2.06"}]
[null,"RS","Quaraí","RS - Quaraí",{"v":4315305,"d":"43.15.3.05"}]
[null,"RS","Quatro Irmãos","RS - Quatro Irmãos",{"v":4315313,"d":"43.15.3.13"}]
[null,"RS","Quevedos","RS - Quevedos",{"v":4315321,"d":"43.15.3.21"}]
[null,"RS","Quinze de Novembro","RS - Quinze de Novembro",{"v":4315354,"d":"43.15.3.54"}]
[null,"RS","Redentora","RS - Redentora",{"v":4315404,"d":"43.15.4.04"}]
[null,"RS","Relvado","RS - Relvado",{"v":4315453,"d":"43.15.4.53"}]
[null,"RS","Restinga Seca","RS - Restinga Seca",{"v":4315503,"d":"43.15.5.03"}]
[null,"RS","Rio dos Índios","RS - Rio dos Índios",{"v":4315552,"d":"43.15.5.52"}]
[null,"RS","Rio Grande","RS - Rio Grande",{"v":4315602,"d":"43.15.6.02"}]
[null,"RS","Rio Pardo","RS - Rio Pardo",{"v":4315701,"d":"43.15.7.01"}]
[null,"RS","Riozinho","RS - Riozinho",{"v":4315750,"d":"43.15.7.50"}]
[null,"RS","Roca Sales","RS - Roca Sales",{"v":4315800,"d":"43.15.8.00"}]
[null,"RS","Rodeio Bonito","RS - Rodeio Bonito",{"v":4315909,"d":"43.15.9.09"}]
[null,"RS","Rolador","RS - Rolador",{"v":4315958,"d":"43.15.9.58"}]
[null,"RS","Rolante","RS - Rolante",{"v":4316006,"d":"43.16.0.06"}]
[null,"RS","Ronda Alta","RS - Ronda Alta",{"v":4316105,"d":"43.16.1.05"}]
[null,"RS","Rondinha","RS - Rondinha",{"v":4316204,"d":"43.16.2.04"}]
[null,"RS","Roque Gonzales","RS - Roque Gonzales",{"v":4316303,"d":"43.16.3.03"}]
[null,"RS","Rosário do Sul","RS - Rosário do Sul",{"v":4316402,"d":"43.16.4.02"}]
[null,"RS","Sagrada Família","RS - Sagrada Família",{"v":4316428,"d":"43.16.4.28"}]
[null,"RS","Saldanha Marinho","RS - Saldanha Marinho",{"v":4316436,"d":"43.16.4.36"}]
[null,"RS","Salto do Jacuí","RS - Salto do Jacuí",{"v":4316451,"d":"43.16.4.51"}]
[null,"RS","Salvador das Missões","RS - Salvador das Missões",{"v":4316477,"d":"43.16.4.77"}]
[null,"RS","Salvador do Sul","RS - Salvador do Sul",{"v":4316501,"d":"43.16.5.01"}]
[null,"RS","Sananduva","RS - Sananduva",{"v":4316600,"d":"43.16.6.00"}]
[null,"RS","Santa Bárbara do Sul","RS - Santa Bárbara do Sul",{"v":4316709,"d":"43.16.7.09"}]
[null,"RS","Santa Cecília do Sul","RS - Santa Cecília do Sul",{"v":4316733,"d":"43.16.7.33"}]
[null,"RS","Santa Clara do Sul","RS - Santa Clara do Sul",{"v":4316758,"d":"43.16.7.58"}]
[null,"RS","Santa Cruz do Sul","RS - Santa Cruz do Sul",{"v":4316808,"d":"43.16.8.08"}]
[null,"RS","Santa Margarida do Sul","RS - Santa Margarida do Sul",{"v":4316972,"d":"43.16.9.72"}]
[null,"RS","Santa Maria","RS - Santa Maria",{"v":4316907,"d":"43.16.9.07"}]
[null,"RS","Santa Maria do Herval","RS - Santa Maria do Herval",{"v":4316956,"d":"43.16.9.56"}]
[null,"RS","Santa Rosa","RS - Santa Rosa",{"v":4317202,"d":"43.17.2.02"}]
[null,"RS","Santa Tereza",{"$f":"CONCATENATE(B4319,\" - \",C4319)","v":"RS - Santa Tereza"},{"v":4317251,"d":"43.17.2.51"}]
[null,"RS","Santa Vitória do Palmar","RS - Santa Vitória do Palmar",{"v":4317301,"d":"43.17.3.01"}]
[null,"RS","Santana da Boa Vista","RS - Santana da Boa Vista",{"v":4317004,"d":"43.17.0.04"}]
[null,"RS","Sant'Ana do Livramento","RS - Sant'Ana do Livramento",{"v":4317103,"d":"43.17.1.03"}]
[null,"RS","Santiago","RS - Santiago",{"v":4317400,"d":"43.17.4.00"}]
[null,"RS","Santo Ângelo","RS - Santo Ângelo",{"v":4317509,"d":"43.17.5.09"}]
[null,"RS","Santo Antônio da Patrulha","RS - Santo Antônio da Patrulha",{"v":4317608,"d":"43.17.6.08"}]
[null,"RS","Santo Antônio das Missões","RS - Santo Antônio das Missões",{"v":4317707,"d":"43.17.7.07"}]
[null,"RS","Santo Antônio do Palma","RS - Santo Antônio do Palma",{"v":4317558,"d":"43.17.5.58"}]
[null,"RS","Santo Antônio do Planalto","RS - Santo Antônio do Planalto",{"v":4317756,"d":"43.17.7.56"}]
[null,"RS","Santo Augusto","RS - Santo Augusto",{"v":4317806,"d":"43.17.8.06"}]
[null,"RS","Santo Cristo","RS - Santo Cristo",{"v":4317905,"d":"43.17.9.05"}]
[null,"RS","Santo Expedito do Sul","RS - Santo Expedito do Sul",{"v":4317954,"d":"43.17.9.54"}]
[null,"RS","São Borja","RS - São Borja",{"v":4318002,"d":"43.18.0.02"}]
[null,"RS","São Domingos do Sul","RS - São Domingos do Sul",{"v":4318051,"d":"43.18.0.51"}]
[null,"RS","São Francisco de Assis","RS - São Francisco de Assis",{"v":4318101,"d":"43.18.1.01"}]
[null,"RS","São Francisco de Paula","RS - São Francisco de Paula",{"v":4318200,"d":"43.18.2.00"}]
[null,"RS","São Gabriel","RS - São Gabriel",{"v":4318309,"d":"43.18.3.09"}]
[null,"RS","São Jerônimo","RS - São Jerônimo",{"v":4318408,"d":"43.18.4.08"}]
[null,"RS","São João da Urtiga","RS - São João da Urtiga",{"v":4318424,"d":"43.18.4.24"}]
[null,"RS","São João do Polêsine","RS - São João do Polêsine",{"v":4318432,"d":"43.18.4.32"}]
[null,"RS","São Jorge","RS - São Jorge",{"v":4318440,"d":"43.18.4.40"}]
[null,"RS","São José das Missões","RS - São José das Missões",{"v":4318457,"d":"43.18.4.57"}]
[null,"RS","São José do Herval","RS - São José do Herval",{"v":4318465,"d":"43.18.4.65"}]
[null,"RS","São José do Hortêncio","RS - São José do Hortêncio",{"v":4318481,"d":"43.18.4.81"}]
[null,"RS","São José do Inhacorá","RS - São José do Inhacorá",{"v":4318499,"d":"43.18.4.99"}]
[null,"RS","São José do Norte","RS - São José do Norte",{"v":4318507,"d":"43.18.5.07"}]
[null,"RS","São José do Ouro","RS - São José do Ouro",{"v":4318606,"d":"43.18.6.06"}]
[null,"RS","São José do Sul","RS - São José do Sul",{"v":4318614,"d":"43.18.6.14"}]
[null,"RS","São José dos Ausentes","RS - São José dos Ausentes",{"v":4318622,"d":"43.18.6.22"}]
[null,"RS","São Leopoldo","RS - São Leopoldo",{"v":4318705,"d":"43.18.7.05"}]
[null,"RS","São Lourenço do Sul","RS - São Lourenço do Sul",{"v":4318804,"d":"43.18.8.04"}]
[null,"RS","São Luiz Gonzaga","RS - São Luiz Gonzaga",{"v":4318903,"d":"43.18.9.03"}]
[null,"RS","São Marcos","RS - São Marcos",{"v":4319000,"d":"43.19.0.00"}]
[null,"RS","São Martinho","RS - São Martinho",{"v":4319109,"d":"43.19.1.09"}]
[null,"RS","São Martinho da Serra","RS - São Martinho da Serra",{"v":4319125,"d":"43.19.1.25"}]
[null,"RS","São Miguel das Missões","RS - São Miguel das Missões",{"v":4319158,"d":"43.19.1.58"}]
[null,"RS","São Nicolau","RS - São Nicolau",{"v":4319208,"d":"43.19.2.08"}]
[null,"RS","São Paulo das Missões","RS - São Paulo das Missões",{"v":4319307,"d":"43.19.3.07"}]
[null,"RS","São Pedro da Serra","RS - São Pedro da Serra",{"v":4319356,"d":"43.19.3.56"}]
[null,"RS","São Pedro das Missões","RS - São Pedro das Missões",{"v":4319364,"d":"43.19.3.64"}]
[null,"RS","São Pedro do Butiá","RS - São Pedro do Butiá",{"v":4319372,"d":"43.19.3.72"}]
[null,"RS","São Pedro do Sul","RS - São Pedro do Sul",{"v":4319406,"d":"43.19.4.06"}]
[null,"RS","São Sebastião do Caí","RS - São Sebastião do Caí",{"v":4319505,"d":"43.19.5.05"}]
[null,"RS","São Sepé","RS - São Sepé",{"v":4319604,"d":"43.19.6.04"}]
[null,"RS","São Valentim","RS - São Valentim",{"v":4319703,"d":"43.19.7.03"}]
[null,"RS","São Valentim do Sul","RS - São Valentim do Sul",{"v":4319711,"d":"43.19.7.11"}]
[null,"RS","São Valério do Sul","RS - São Valério do Sul",{"v":4319737,"d":"43.19.7.37"}]
[null,"RS","São Vendelino","RS - São Vendelino",{"v":4319752,"d":"43.19.7.52"}]
[null,"RS","São Vicente do Sul","RS - São Vicente do Sul",{"v":4319802,"d":"43.19.8.02"}]
[null,"RS","Sapiranga","RS - Sapiranga",{"v":4319901,"d":"43.19.9.01"}]
[null,"RS","Sapucaia do Sul","RS - Sapucaia do Sul",{"v":4320008,"d":"43.20.0.08"}]
[null,"RS","Sarandi","RS - Sarandi",{"v":4320107,"d":"43.20.1.07"}]
[null,"RS","Seberi","RS - Seberi",{"v":4320206,"d":"43.20.2.06"}]
[null,"RS","Sede Nova","RS - Sede Nova",{"v":4320230,"d":"43.20.2.30"}]
[null,"RS","Segredo","RS - Segredo",{"v":4320263,"d":"43.20.2.63"}]
[null,"RS","Selbach","RS - Selbach",{"v":4320305,"d":"43.20.3.05"}]
[null,"RS","Senador Salgado Filho","RS - Senador Salgado Filho",{"v":4320321,"d":"43.20.3.21"}]
[null,"RS","Sentinela do Sul","RS - Sentinela do Sul",{"v":4320354,"d":"43.20.3.54"}]
[null,"RS","Serafina Corrêa","RS - Serafina Corrêa",{"v":4320404,"d":"43.20.4.04"}]
[null,"RS","Sério","RS - Sério",{"v":4320453,"d":"43.20.4.53"}]
[null,"RS","Sertão","RS - Sertão",{"v":4320503,"d":"43.20.5.03"}]
[null,"RS","Sertão Santana","RS - Sertão Santana",{"v":4320552,"d":"43.20.5.52"}]
[null,"RS","Sete de Setembro","RS - Sete de Setembro",{"v":4320578,"d":"43.20.5.78"}]
[null,"RS","Severiano de Almeida",{"$f":"CONCATENATE(B4383,\" - \",C4383)","v":"RS - Severiano de Almeida"},{"v":4320602,"d":"43.20.6.02"}]
[null,"RS","Silveira Martins","RS - Silveira Martins",{"v":4320651,"d":"43.20.6.51"}]
[null,"RS","Sinimbu","RS - Sinimbu",{"v":4320677,"d":"43.20.6.77"}]
[null,"RS","Sobradinho","RS - Sobradinho",{"v":4320701,"d":"43.20.7.01"}]
[null,"RS","Soledade","RS - Soledade",{"v":4320800,"d":"43.20.8.00"}]
[null,"RS","Tabaí","RS - Tabaí",{"v":4320859,"d":"43.20.8.59"}]
[null,"RS","Tapejara","RS - Tapejara",{"v":4320909,"d":"43.20.9.09"}]
[null,"RS","Tapera","RS - Tapera",{"v":4321006,"d":"43.21.0.06"}]
[null,"RS","Tapes","RS - Tapes",{"v":4321105,"d":"43.21.1.05"}]
[null,"RS","Taquara","RS - Taquara",{"v":4321204,"d":"43.21.2.04"}]
[null,"RS","Taquari","RS - Taquari",{"v":4321303,"d":"43.21.3.03"}]
[null,"RS","Taquaruçu do Sul","RS - Taquaruçu do Sul",{"v":4321329,"d":"43.21.3.29"}]
[null,"RS","Tavares","RS - Tavares",{"v":4321352,"d":"43.21.3.52"}]
[null,"RS","Tenente Portela","RS - Tenente Portela",{"v":4321402,"d":"43.21.4.02"}]
[null,"RS","Terra de Areia","RS - Terra de Areia",{"v":4321436,"d":"43.21.4.36"}]
[null,"RS","Teutônia","RS - Teutônia",{"v":4321451,"d":"43.21.4.51"}]
[null,"RS","Tio Hugo","RS - Tio Hugo",{"v":4321469,"d":"43.21.4.69"}]
[null,"RS","Tiradentes do Sul","RS - Tiradentes do Sul",{"v":4321477,"d":"43.21.4.77"}]
[null,"RS","Toropi","RS - Toropi",{"v":4321493,"d":"43.21.4.93"}]
[null,"RS","Torres","RS - Torres",{"v":4321501,"d":"43.21.5.01"}]
[null,"RS","Tramandaí","RS - Tramandaí",{"v":4321600,"d":"43.21.6.00"}]
[null,"RS","Travesseiro","RS - Travesseiro",{"v":4321626,"d":"43.21.6.26"}]
[null,"RS","Três Arroios","RS - Três Arroios",{"v":4321634,"d":"43.21.6.34"}]
[null,"RS","Três Cachoeiras","RS - Três Cachoeiras",{"v":4321667,"d":"43.21.6.67"}]
[null,"RS","Três Coroas","RS - Três Coroas",{"v":4321709,"d":"43.21.7.09"}]
[null,"RS","Três de Maio","RS - Três de Maio",{"v":4321808,"d":"43.21.8.08"}]
[null,"RS","Três Forquilhas","RS - Três Forquilhas",{"v":4321832,"d":"43.21.8.32"}]
[null,"RS","Três Palmeiras","RS - Três Palmeiras",{"v":4321857,"d":"43.21.8.57"}]
[null,"RS","Três Passos","RS - Três Passos",{"v":4321907,"d":"43.21.9.07"}]
[null,"RS","Trindade do Sul","RS - Trindade do Sul",{"v":4321956,"d":"43.21.9.56"}]
[null,"RS","Triunfo","RS - Triunfo",{"v":4322004,"d":"43.22.0.04"}]
[null,"RS","Tucunduva","RS - Tucunduva",{"v":4322103,"d":"43.22.1.03"}]
[null,"RS","Tunas","RS - Tunas",{"v":4322152,"d":"43.22.1.52"}]
[null,"RS","Tupanci do Sul","RS - Tupanci do Sul",{"v":4322186,"d":"43.22.1.86"}]
[null,"RS","Tupanciretã","RS - Tupanciretã",{"v":4322202,"d":"43.22.2.02"}]
[null,"RS","Tupandi","RS - Tupandi",{"v":4322251,"d":"43.22.2.51"}]
[null,"RS","Tuparendi","RS - Tuparendi",{"v":4322301,"d":"43.22.3.01"}]
[null,"RS","Turuçu","RS - Turuçu",{"v":4322327,"d":"43.22.3.27"}]
[null,"RS","Ubiretama","RS - Ubiretama",{"v":4322343,"d":"43.22.3.43"}]
[null,"RS","União da Serra","RS - União da Serra",{"v":4322350,"d":"43.22.3.50"}]
[null,"RS","Unistalda","RS - Unistalda",{"v":4322376,"d":"43.22.3.76"}]
[null,"RS","Uruguaiana","RS - Uruguaiana",{"v":4322400,"d":"43.22.4.00"}]
[null,"RS","Vacaria","RS - Vacaria",{"v":4322509,"d":"43.22.5.09"}]
[null,"RS","Vale do Sol","RS - Vale do Sol",{"v":4322533,"d":"43.22.5.33"}]
[null,"RS","Vale Real","RS - Vale Real",{"v":4322541,"d":"43.22.5.41"}]
[null,"RS","Vale Verde","RS - Vale Verde",{"v":4322525,"d":"43.22.5.25"}]
[null,"RS","Vanini","RS - Vanini",{"v":4322558,"d":"43.22.5.58"}]
[null,"RS","Venâncio Aires","RS - Venâncio Aires",{"v":4322608,"d":"43.22.6.08"}]
[null,"RS","Vera Cruz","RS - Vera Cruz",{"v":4322707,"d":"43.22.7.07"}]
[null,"RS","Veranópolis","RS - Veranópolis",{"v":4322806,"d":"43.22.8.06"}]
[null,"RS","Vespasiano Correa","RS - Vespasiano Correa",{"v":4322855,"d":"43.22.8.55"}]
[null,"RS","Viadutos","RS - Viadutos",{"v":4322905,"d":"43.22.9.05"}]
[null,"RS","Viamão","RS - Viamão",{"v":4323002,"d":"43.23.0.02"}]
[null,"RS","Vicente Dutra","RS - Vicente Dutra",{"v":4323101,"d":"43.23.1.01"}]
[null,"RS","Victor Graeff","RS - Victor Graeff",{"v":4323200,"d":"43.23.2.00"}]
[null,"RS","Vila Flores","RS - Vila Flores",{"v":4323309,"d":"43.23.3.09"}]
[null,"RS","Vila Lângaro","RS - Vila Lângaro",{"v":4323358,"d":"43.23.3.58"}]
[null,"RS","Vila Maria","RS - Vila Maria",{"v":4323408,"d":"43.23.4.08"}]
[null,"RS","Vila Nova do Sul","RS - Vila Nova do Sul",{"v":4323457,"d":"43.23.4.57"}]
[null,"RS","Vista Alegre","RS - Vista Alegre",{"v":4323507,"d":"43.23.5.07"}]
[null,"RS","Vista Alegre do Prata","RS - Vista Alegre do Prata",{"v":4323606,"d":"43.23.6.06"}]
[null,"RS","Vista Gaúcha","RS - Vista Gaúcha",{"v":4323705,"d":"43.23.7.05"}]
[null,"RS","Vitória das Missões","RS - Vitória das Missões",{"v":4323754,"d":"43.23.7.54"}]
[null,"RS","Westfalia","RS - Westfalia",{"v":4323770,"d":"43.23.7.70"}]
[null,"RS","Xangri-lá",{"$f":"CONCATENATE(B4447,\" - \",C4447)","v":"RS - Xangri-lá"},{"v":4323804,"d":"43.23.8.04"}]
[null,"SC","Abdon Batista","SC - Abdon Batista",{"v":4200051,"d":"42.00.0.51"}]
[null,"SC","Abelardo Luz","SC - Abelardo Luz",{"v":4200101,"d":"42.00.1.01"}]
[null,"SC","Agrolândia","SC - Agrolândia",{"v":4200200,"d":"42.00.2.00"}]
[null,"SC","Agronômica","SC - Agronômica",{"v":4200309,"d":"42.00.3.09"}]
[null,"SC","Água Doce","SC - Água Doce",{"v":4200408,"d":"42.00.4.08"}]
[null,"SC","Águas de Chapecó","SC - Águas de Chapecó",{"v":4200507,"d":"42.00.5.07"}]
[null,"SC","Águas Frias","SC - Águas Frias",{"v":4200556,"d":"42.00.5.56"}]
[null,"SC","Águas Mornas","SC - Águas Mornas",{"v":4200606,"d":"42.00.6.06"}]
[null,"SC","Alfredo Wagner","SC - Alfredo Wagner",{"v":4200705,"d":"42.00.7.05"}]
[null,"SC","Alto Bela Vista","SC - Alto Bela Vista",{"v":4200754,"d":"42.00.7.54"}]
[null,"SC","Anchieta","SC - Anchieta",{"v":4200804,"d":"42.00.8.04"}]
[null,"SC","Angelina","SC - Angelina",{"v":4200903,"d":"42.00.9.03"}]
[null,"SC","Anita Garibaldi","SC - Anita Garibaldi",{"v":4201000,"d":"42.01.0.00"}]
[null,"SC","Anitápolis","SC - Anitápolis",{"v":4201109,"d":"42.01.1.09"}]
[null,"SC","Antônio Carlos","SC - Antônio Carlos",{"v":4201208,"d":"42.01.2.08"}]
[null,"SC","Apiúna","SC - Apiúna",{"v":4201257,"d":"42.01.2.57"}]
[null,"SC","Arabutã","SC - Arabutã",{"v":4201273,"d":"42.01.2.73"}]
[null,"SC","Araquari","SC - Araquari",{"v":4201307,"d":"42.01.3.07"}]
[null,"SC","Araranguá","SC - Araranguá",{"v":4201406,"d":"42.01.4.06"}]
[null,"SC","Armazém","SC - Armazém",{"v":4201505,"d":"42.01.5.05"}]
[null,"SC","Arroio Trinta","SC - Arroio Trinta",{"v":4201604,"d":"42.01.6.04"}]
[null,"SC","Arvoredo","SC - Arvoredo",{"v":4201653,"d":"42.01.6.53"}]
[null,"SC","Ascurra","SC - Ascurra",{"v":4201703,"d":"42.01.7.03"}]
[null,"SC","Atalanta","SC - Atalanta",{"v":4201802,"d":"42.01.8.02"}]
[null,"SC","Aurora","SC - Aurora",{"v":4201901,"d":"42.01.9.01"}]
[null,"SC","Balneário Arroio do Silva","SC - Balneário Arroio do Silva",{"v":4201950,"d":"42.01.9.50"}]
[null,"SC","Balneário Barra do Sul","SC - Balneário Barra do Sul",{"v":4202057,"d":"42.02.0.57"}]
[null,"SC","Balneário Camboriú","SC - Balneário Camboriú",{"v":4202008,"d":"42.02.0.08"}]
[null,"SC","Balneário Gaivota","SC - Balneário Gaivota",{"v":4202073,"d":"42.02.0.73"}]
[null,"SC","Balneário Piçarras","SC - Balneário Piçarras",{"v":4212809,"d":"42.12.8.09"}]
[null,"SC","Bandeirante","SC - Bandeirante",{"v":4202081,"d":"42.02.0.81"}]
[null,"SC","Barra Bonita","SC - Barra Bonita",{"v":4202099,"d":"42.02.0.99"}]
[null,"SC","Barra Velha","SC - Barra Velha",{"v":4202107,"d":"42.02.1.07"}]
[null,"SC","Bela Vista do Toldo","SC - Bela Vista do Toldo",{"v":4202131,"d":"42.02.1.31"}]
[null,"SC","Belmonte","SC - Belmonte",{"v":4202156,"d":"42.02.1.56"}]
[null,"SC","Benedito Novo","SC - Benedito Novo",{"v":4202206,"d":"42.02.2.06"}]
[null,"SC","Biguaçu","SC - Biguaçu",{"v":4202305,"d":"42.02.3.05"}]
[null,"SC","Blumenau","SC - Blumenau",{"v":4202404,"d":"42.02.4.04"}]
[null,"SC","Bocaina do Sul","SC - Bocaina do Sul",{"v":4202438,"d":"42.02.4.38"}]
[null,"SC","Bom Jardim da Serra","SC - Bom Jardim da Serra",{"v":4202503,"d":"42.02.5.03"}]
[null,"SC","Bom Jesus","SC - Bom Jesus",{"v":4202537,"d":"42.02.5.37"}]
[null,"SC","Bom Jesus do Oeste","SC - Bom Jesus do Oeste",{"v":4202578,"d":"42.02.5.78"}]
[null,"SC","Bom Retiro","SC - Bom Retiro",{"v":4202602,"d":"42.02.6.02"}]
[null,"SC","Bombinhas","SC - Bombinhas",{"v":4202453,"d":"42.02.4.53"}]
[null,"SC","Botuverá","SC - Botuverá",{"v":4202701,"d":"42.02.7.01"}]
[null,"SC","Braço do Norte","SC - Braço do Norte",{"v":4202800,"d":"42.02.8.00"}]
[null,"SC","Braço do Trombudo","SC - Braço do Trombudo",{"v":4202859,"d":"42.02.8.59"}]
[null,"SC","Brunópolis","SC - Brunópolis",{"v":4202875,"d":"42.02.8.75"}]
[null,"SC","Brusque","SC - Brusque",{"v":4202909,"d":"42.02.9.09"}]
[null,"SC","Caçador","SC - Caçador",{"v":4203006,"d":"42.03.0.06"}]
[null,"SC","Caibi","SC - Caibi",{"v":4203105,"d":"42.03.1.05"}]
[null,"SC","Calmon","SC - Calmon",{"v":4203154,"d":"42.03.1.54"}]
[null,"SC","Camboriú","SC - Camboriú",{"v":4203204,"d":"42.03.2.04"}]
[null,"SC","Campo Alegre","SC - Campo Alegre",{"v":4203303,"d":"42.03.3.03"}]
[null,"SC","Campo Belo do Sul","SC - Campo Belo do Sul",{"v":4203402,"d":"42.03.4.02"}]
[null,"SC","Campo Erê","SC - Campo Erê",{"v":4203501,"d":"42.03.5.01"}]
[null,"SC","Campos Novos","SC - Campos Novos",{"v":4203600,"d":"42.03.6.00"}]
[null,"SC","Canelinha","SC - Canelinha",{"v":4203709,"d":"42.03.7.09"}]
[null,"SC","Canoinhas","SC - Canoinhas",{"v":4203808,"d":"42.03.8.08"}]
[null,"SC","Capão Alto","SC - Capão Alto",{"v":4203253,"d":"42.03.2.53"}]
[null,"SC","Capinzal","SC - Capinzal",{"v":4203907,"d":"42.03.9.07"}]
[null,"SC","Capivari de Baixo","SC - Capivari de Baixo",{"v":4203956,"d":"42.03.9.56"}]
[null,"SC","Catanduvas","SC - Catanduvas",{"v":4204004,"d":"42.04.0.04"}]
[null,"SC","Caxambu do Sul",{"$f":"CONCATENATE(B4511,\" - \",C4511)","v":"SC - Caxambu do Sul"},{"v":4204103,"d":"42.04.1.03"}]
[null,"SC","Celso Ramos","SC - Celso Ramos",{"v":4204152,"d":"42.04.1.52"}]
[null,"SC","Cerro Negro","SC - Cerro Negro",{"v":4204178,"d":"42.04.1.78"}]
[null,"SC","Chapadão do Lageado","SC - Chapadão do Lageado",{"v":4204194,"d":"42.04.1.94"}]
[null,"SC","Chapecó","SC - Chapecó",{"v":4204202,"d":"42.04.2.02"}]
[null,"SC","Cocal do Sul","SC - Cocal do Sul",{"v":4204251,"d":"42.04.2.51"}]
[null,"SC","Concórdia","SC - Concórdia",{"v":4204301,"d":"42.04.3.01"}]
[null,"SC","Cordilheira Alta","SC - Cordilheira Alta",{"v":4204350,"d":"42.04.3.50"}]
[null,"SC","Coronel Freitas","SC - Coronel Freitas",{"v":4204400,"d":"42.04.4.00"}]
[null,"SC","Coronel Martins","SC - Coronel Martins",{"v":4204459,"d":"42.04.4.59"}]
[null,"SC","Correia Pinto","SC - Correia Pinto",{"v":4204558,"d":"42.04.5.58"}]
[null,"SC","Corupá","SC - Corupá",{"v":4204509,"d":"42.04.5.09"}]
[null,"SC","Criciúma","SC - Criciúma",{"v":4204608,"d":"42.04.6.08"}]
[null,"SC","Cunha Porã","SC - Cunha Porã",{"v":4204707,"d":"42.04.7.07"}]
[null,"SC","Cunhataí","SC - Cunhataí",{"v":4204756,"d":"42.04.7.56"}]
[null,"SC","Curitibanos","SC - Curitibanos",{"v":4204806,"d":"42.04.8.06"}]
[null,"SC","Descanso","SC - Descanso",{"v":4204905,"d":"42.04.9.05"}]
[null,"SC","Dionísio Cerqueira","SC - Dionísio Cerqueira",{"v":4205001,"d":"42.05.0.01"}]
[null,"SC","Dona Emma","SC - Dona Emma",{"v":4205100,"d":"42.05.1.00"}]
[null,"SC","Doutor Pedrinho","SC - Doutor Pedrinho",{"v":4205159,"d":"42.05.1.59"}]
[null,"SC","Entre Rios","SC - Entre Rios",{"v":4205175,"d":"42.05.1.75"}]
[null,"SC","Ermo","SC - Ermo",{"v":4205191,"d":"42.05.1.91"}]
[null,"SC","Erval Velho","SC - Erval Velho",{"v":4205209,"d":"42.05.2.09"}]
[null,"SC","Faxinal dos Guedes","SC - Faxinal dos Guedes",{"v":4205308,"d":"42.05.3.08"}]
[null,"SC","Flor do Sertão","SC - Flor do Sertão",{"v":4205357,"d":"42.05.3.57"}]
[null,"SC","Florianópolis","SC - Florianópolis",{"v":4205407,"d":"42.05.4.07"}]
[null,"SC","Formosa do Sul","SC - Formosa do Sul",{"v":4205431,"d":"42.05.4.31"}]
[null,"SC","Forquilhinha","SC - Forquilhinha",{"v":4205456,"d":"42.05.4.56"}]
[null,"SC","Fraiburgo","SC - Fraiburgo",{"v":4205506,"d":"42.05.5.06"}]
[null,"SC","Frei Rogério","SC - Frei Rogério",{"v":4205555,"d":"42.05.5.55"}]
[null,"SC","Galvão","SC - Galvão",{"v":4205605,"d":"42.05.6.05"}]
[null,"SC","Garopaba","SC - Garopaba",{"v":4205704,"d":"42.05.7.04"}]
[null,"SC","Garuva","SC - Garuva",{"v":4205803,"d":"42.05.8.03"}]
[null,"SC","Gaspar","SC - Gaspar",{"v":4205902,"d":"42.05.9.02"}]
[null,"SC","Governador Celso Ramos","SC - Governador Celso Ramos",{"v":4206009,"d":"42.06.0.09"}]
[null,"SC","Grão Pará","SC - Grão Pará",{"v":4206108,"d":"42.06.1.08"}]
[null,"SC","Gravatal","SC - Gravatal",{"v":4206207,"d":"42.06.2.07"}]
[null,"SC","Guabiruba","SC - Guabiruba",{"v":4206306,"d":"42.06.3.06"}]
[null,"SC","Guaraciaba","SC - Guaraciaba",{"v":4206405,"d":"42.06.4.05"}]
[null,"SC","Guaramirim","SC - Guaramirim",{"v":4206504,"d":"42.06.5.04"}]
[null,"SC","Guarujá do Sul","SC - Guarujá do Sul",{"v":4206603,"d":"42.06.6.03"}]
[null,"SC","Guatambú","SC - Guatambú",{"v":4206652,"d":"42.06.6.52"}]
[null,"SC","Herval d'Oeste","SC - Herval d'Oeste",{"v":4206702,"d":"42.06.7.02"}]
[null,"SC","Ibiam","SC - Ibiam",{"v":4206751,"d":"42.06.7.51"}]
[null,"SC","Ibicaré","SC - Ibicaré",{"v":4206801,"d":"42.06.8.01"}]
[null,"SC","Ibirama","SC - Ibirama",{"v":4206900,"d":"42.06.9.00"}]
[null,"SC","Içara","SC - Içara",{"v":4207007,"d":"42.07.0.07"}]
[null,"SC","Ilhota","SC - Ilhota",{"v":4207106,"d":"42.07.1.06"}]
[null,"SC","Imaruí","SC - Imaruí",{"v":4207205,"d":"42.07.2.05"}]
[null,"SC","Imbituba","SC - Imbituba",{"v":4207304,"d":"42.07.3.04"}]
[null,"SC","Imbuia","SC - Imbuia",{"v":4207403,"d":"42.07.4.03"}]
[null,"SC","Indaial","SC - Indaial",{"v":4207502,"d":"42.07.5.02"}]
[null,"SC","Iomerê","SC - Iomerê",{"v":4207577,"d":"42.07.5.77"}]
[null,"SC","Ipira","SC - Ipira",{"v":4207601,"d":"42.07.6.01"}]
[null,"SC","Iporã do Oeste","SC - Iporã do Oeste",{"v":4207650,"d":"42.07.6.50"}]
[null,"SC","Ipuaçu","SC - Ipuaçu",{"v":4207684,"d":"42.07.6.84"}]
[null,"SC","Ipumirim","SC - Ipumirim",{"v":4207700,"d":"42.07.7.00"}]
[null,"SC","Iraceminha","SC - Iraceminha",{"v":4207759,"d":"42.07.7.59"}]
[null,"SC","Irani","SC - Irani",{"v":4207809,"d":"42.07.8.09"}]
[null,"SC","Irati","SC - Irati",{"v":4207858,"d":"42.07.8.58"}]
[null,"SC","Irineópolis","SC - Irineópolis",{"v":4207908,"d":"42.07.9.08"}]
[null,"SC","Itá","SC - Itá",{"v":4208005,"d":"42.08.0.05"}]
[null,"SC","Itaiópolis","SC - Itaiópolis",{"v":4208104,"d":"42.08.1.04"}]
[null,"SC","Itajaí","SC - Itajaí",{"v":4208203,"d":"42.08.2.03"}]
[null,"SC","Itapema",{"$f":"CONCATENATE(B4575,\" - \",C4575)","v":"SC - Itapema"},{"v":4208302,"d":"42.08.3.02"}]
[null,"SC","Itapiranga","SC - Itapiranga",{"v":4208401,"d":"42.08.4.01"}]
[null,"SC","Itapoá","SC - Itapoá",{"v":4208450,"d":"42.08.4.50"}]
[null,"SC","Ituporanga","SC - Ituporanga",{"v":4208500,"d":"42.08.5.00"}]
[null,"SC","Jaborá","SC - Jaborá",{"v":4208609,"d":"42.08.6.09"}]
[null,"SC","Jacinto Machado","SC - Jacinto Machado",{"v":4208708,"d":"42.08.7.08"}]
[null,"SC","Jaguaruna","SC - Jaguaruna",{"v":4208807,"d":"42.08.8.07"}]
[null,"SC","Jaraguá do Sul","SC - Jaraguá do Sul",{"v":4208906,"d":"42.08.9.06"}]
[null,"SC","Jardinópolis","SC - Jardinópolis",{"v":4208955,"d":"42.08.9.55"}]
[null,"SC","Joaçaba","SC - Joaçaba",{"v":4209003,"d":"42.09.0.03"}]
[null,"SC","Joinville","SC - Joinville",{"v":4209102,"d":"42.09.1.02"}]
[null,"SC","José Boiteux","SC - José Boiteux",{"v":4209151,"d":"42.09.1.51"}]
[null,"SC","Jupiá","SC - Jupiá",{"v":4209177,"d":"42.09.1.77"}]
[null,"SC","Lacerdópolis","SC - Lacerdópolis",{"v":4209201,"d":"42.09.2.01"}]
[null,"SC","Lages","SC - Lages",{"v":4209300,"d":"42.09.3.00"}]
[null,"SC","Laguna","SC - Laguna",{"v":4209409,"d":"42.09.4.09"}]
[null,"SC","Lajeado Grande","SC - Lajeado Grande",{"v":4209458,"d":"42.09.4.58"}]
[null,"SC","Laurentino","SC - Laurentino",{"v":4209508,"d":"42.09.5.08"}]
[null,"SC","Lauro Muller","SC - Lauro Muller",{"v":4209607,"d":"42.09.6.07"}]
[null,"SC","Lebon Régis","SC - Lebon Régis",{"v":4209706,"d":"42.09.7.06"}]
[null,"SC","Leoberto Leal","SC - Leoberto Leal",{"v":4209805,"d":"42.09.8.05"}]
[null,"SC","Lindóia do Sul","SC - Lindóia do Sul",{"v":4209854,"d":"42.09.8.54"}]
[null,"SC","Lontras","SC - Lontras",{"v":4209904,"d":"42.09.9.04"}]
[null,"SC","Luiz Alves","SC - Luiz Alves",{"v":4210001,"d":"42.10.0.01"}]
[null,"SC","Luzerna","SC - Luzerna",{"v":4210035,"d":"42.10.0.35"}]
[null,"SC","Macieira","SC - Macieira",{"v":4210050,"d":"42.10.0.50"}]
[null,"SC","Mafra","SC - Mafra",{"v":4210100,"d":"42.10.1.00"}]
[null,"SC","Major Gercino","SC - Major Gercino",{"v":4210209,"d":"42.10.2.09"}]
[null,"SC","Major Vieira","SC - Major Vieira",{"v":4210308,"d":"42.10.3.08"}]
[null,"SC","Maracajá","SC - Maracajá",{"v":4210407,"d":"42.10.4.07"}]
[null,"SC","Maravilha","SC - Maravilha",{"v":4210506,"d":"42.10.5.06"}]
[null,"SC","Marema","SC - Marema",{"v":4210555,"d":"42.10.5.55"}]
[null,"SC","Massaranduba","SC - Massaranduba",{"v":4210605,"d":"42.10.6.05"}]
[null,"SC","Matos Costa","SC - Matos Costa",{"v":4210704,"d":"42.10.7.04"}]
[null,"SC","Meleiro","SC - Meleiro",{"v":4210803,"d":"42.10.8.03"}]
[null,"SC","Mirim Doce","SC - Mirim Doce",{"v":4210852,"d":"42.10.8.52"}]
[null,"SC","Modelo","SC - Modelo",{"v":4210902,"d":"42.10.9.02"}]
[null,"SC","Mondaí","SC - Mondaí",{"v":4211009,"d":"42.11.0.09"}]
[null,"SC","Monte Carlo","SC - Monte Carlo",{"v":4211058,"d":"42.11.0.58"}]
[null,"SC","Monte Castelo","SC - Monte Castelo",{"v":4211108,"d":"42.11.1.08"}]
[null,"SC","Morro da Fumaça","SC - Morro da Fumaça",{"v":4211207,"d":"42.11.2.07"}]
[null,"SC","Morro Grande","SC - Morro Grande",{"v":4211256,"d":"42.11.2.56"}]
[null,"SC","Navegantes","SC - Navegantes",{"v":4211306,"d":"42.11.3.06"}]
[null,"SC","Nova Erechim","SC - Nova Erechim",{"v":4211405,"d":"42.11.4.05"}]
[null,"SC","Nova Itaberaba","SC - Nova Itaberaba",{"v":4211454,"d":"42.11.4.54"}]
[null,"SC","Nova Trento","SC - Nova Trento",{"v":4211504,"d":"42.11.5.04"}]
[null,"SC","Nova Veneza","SC - Nova Veneza",{"v":4211603,"d":"42.11.6.03"}]
[null,"SC","Novo Horizonte","SC - Novo Horizonte",{"v":4211652,"d":"42.11.6.52"}]
[null,"SC","Orleans","SC - Orleans",{"v":4211702,"d":"42.11.7.02"}]
[null,"SC","Otacílio Costa","SC - Otacílio Costa",{"v":4211751,"d":"42.11.7.51"}]
[null,"SC","Ouro","SC - Ouro",{"v":4211801,"d":"42.11.8.01"}]
[null,"SC","Ouro Verde","SC - Ouro Verde",{"v":4211850,"d":"42.11.8.50"}]
[null,"SC","Paial","SC - Paial",{"v":4211876,"d":"42.11.8.76"}]
[null,"SC","Painel","SC - Painel",{"v":4211892,"d":"42.11.8.92"}]
[null,"SC","Palhoça","SC - Palhoça",{"v":4211900,"d":"42.11.9.00"}]
[null,"SC","Palma Sola","SC - Palma Sola",{"v":4212007,"d":"42.12.0.07"}]
[null,"SC","Palmeira","SC - Palmeira",{"v":4212056,"d":"42.12.0.56"}]
[null,"SC","Palmitos","SC - Palmitos",{"v":4212106,"d":"42.12.1.06"}]
[null,"SC","Papanduva","SC - Papanduva",{"v":4212205,"d":"42.12.2.05"}]
[null,"SC","Paraíso","SC - Paraíso",{"v":4212239,"d":"42.12.2.39"}]
[null,"SC","Passo de Torres","SC - Passo de Torres",{"v":4212254,"d":"42.12.2.54"}]
[null,"SC","Passos Maia","SC - Passos Maia",{"v":4212270,"d":"42.12.2.70"}]
[null,"SC","Paulo Lopes","SC - Paulo Lopes",{"v":4212304,"d":"42.12.3.04"}]
[null,"SC","Pedras Grandes","SC - Pedras Grandes",{"v":4212403,"d":"42.12.4.03"}]
[null,"SC","Penha",{"$f":"CONCATENATE(B4639,\" - \",C4639)","v":"SC - Penha"},{"v":4212502,"d":"42.12.5.02"}]
[null,"SC","Peritiba","SC - Peritiba",{"v":4212601,"d":"42.12.6.01"}]
[null,"SC","Petrolândia","SC - Petrolândia",{"v":4212700,"d":"42.12.7.00"}]
[null,"SC","Pinhalzinho","SC - Pinhalzinho",{"v":4212908,"d":"42.12.9.08"}]
[null,"SC","Pinheiro Preto","SC - Pinheiro Preto",{"v":4213005,"d":"42.13.0.05"}]
[null,"SC","Piratuba","SC - Piratuba",{"v":4213104,"d":"42.13.1.04"}]
[null,"SC","Planalto Alegre","SC - Planalto Alegre",{"v":4213153,"d":"42.13.1.53"}]
[null,"SC","Pomerode","SC - Pomerode",{"v":4213203,"d":"42.13.2.03"}]
[null,"SC","Ponte Alta","SC - Ponte Alta",{"v":4213302,"d":"42.13.3.02"}]
[null,"SC","Ponte Alta do Norte","SC - Ponte Alta do Norte",{"v":4213351,"d":"42.13.3.51"}]
[null,"SC","Ponte Serrada","SC - Ponte Serrada",{"v":4213401,"d":"42.13.4.01"}]
[null,"SC","Porto Belo","SC - Porto Belo",{"v":4213500,"d":"42.13.5.00"}]
[null,"SC","Porto União","SC - Porto União",{"v":4213609,"d":"42.13.6.09"}]
[null,"SC","Pouso Redondo","SC - Pouso Redondo",{"v":4213708,"d":"42.13.7.08"}]
[null,"SC","Praia Grande","SC - Praia Grande",{"v":4213807,"d":"42.13.8.07"}]
[null,"SC","Presidente Castello Branco","SC - Presidente Castello Branco",{"v":4213906,"d":"42.13.9.06"}]
[null,"SC","Presidente Getúlio","SC - Presidente Getúlio",{"v":4214003,"d":"42.14.0.03"}]
[null,"SC","Presidente Nereu","SC - Presidente Nereu",{"v":4214102,"d":"42.14.1.02"}]
[null,"SC","Princesa","SC - Princesa",{"v":4214151,"d":"42.14.1.51"}]
[null,"SC","Quilombo","SC - Quilombo",{"v":4214201,"d":"42.14.2.01"}]
[null,"SC","Rancho Queimado","SC - Rancho Queimado",{"v":4214300,"d":"42.14.3.00"}]
[null,"SC","Rio das Antas","SC - Rio das Antas",{"v":4214409,"d":"42.14.4.09"}]
[null,"SC","Rio do Campo","SC - Rio do Campo",{"v":4214508,"d":"42.14.5.08"}]
[null,"SC","Rio do Oeste","SC - Rio do Oeste",{"v":4214607,"d":"42.14.6.07"}]
[null,"SC","Rio do Sul","SC - Rio do Sul",{"v":4214805,"d":"42.14.8.05"}]
[null,"SC","Rio dos Cedros","SC - Rio dos Cedros",{"v":4214706,"d":"42.14.7.06"}]
[null,"SC","Rio Fortuna","SC - Rio Fortuna",{"v":4214904,"d":"42.14.9.04"}]
[null,"SC","Rio Negrinho","SC - Rio Negrinho",{"v":4215000,"d":"42.15.0.00"}]
[null,"SC","Rio Rufino","SC - Rio Rufino",{"v":4215059,"d":"42.15.0.59"}]
[null,"SC","Riqueza","SC - Riqueza",{"v":4215075,"d":"42.15.0.75"}]
[null,"SC","Rodeio","SC - Rodeio",{"v":4215109,"d":"42.15.1.09"}]
[null,"SC","Romelândia","SC - Romelândia",{"v":4215208,"d":"42.15.2.08"}]
[null,"SC","Salete","SC - Salete",{"v":4215307,"d":"42.15.3.07"}]
[null,"SC","Saltinho","SC - Saltinho",{"v":4215356,"d":"42.15.3.56"}]
[null,"SC","Salto Veloso","SC - Salto Veloso",{"v":4215406,"d":"42.15.4.06"}]
[null,"SC","Sangão","SC - Sangão",{"v":4215455,"d":"42.15.4.55"}]
[null,"SC","Santa Cecília","SC - Santa Cecília",{"v":4215505,"d":"42.15.5.05"}]
[null,"SC","Santa Helena","SC - Santa Helena",{"v":4215554,"d":"42.15.5.54"}]
[null,"SC","Santa Rosa de Lima","SC - Santa Rosa de Lima",{"v":4215604,"d":"42.15.6.04"}]
[null,"SC","Santa Rosa do Sul","SC - Santa Rosa do Sul",{"v":4215653,"d":"42.15.6.53"}]
[null,"SC","Santa Terezinha","SC - Santa Terezinha",{"v":4215679,"d":"42.15.6.79"}]
[null,"SC","Santa Terezinha do Progresso","SC - Santa Terezinha do Progresso",{"v":4215687,"d":"42.15.6.87"}]
[null,"SC","Santiago do Sul","SC - Santiago do Sul",{"v":4215695,"d":"42.15.6.95"}]
[null,"SC","Santo Amaro da Imperatriz","SC - Santo Amaro da Imperatriz",{"v":4215703,"d":"42.15.7.03"}]
[null,"SC","São Bento do Sul","SC - São Bento do Sul",{"v":4215802,"d":"42.15.8.02"}]
[null,"SC","São Bernardino","SC - São Bernardino",{"v":4215752,"d":"42.15.7.52"}]
[null,"SC","São Bonifácio","SC - São Bonifácio",{"v":4215901,"d":"42.15.9.01"}]
[null,"SC","São Carlos","SC - São Carlos",{"v":4216008,"d":"42.16.0.08"}]
[null,"SC","São Cristovão do Sul","SC - São Cristovão do Sul",{"v":4216057,"d":"42.16.0.57"}]
[null,"SC","São Domingos","SC - São Domingos",{"v":4216107,"d":"42.16.1.07"}]
[null,"SC","São Francisco do Sul","SC - São Francisco do Sul",{"v":4216206,"d":"42.16.2.06"}]
[null,"SC","São João Batista","SC - São João Batista",{"v":4216305,"d":"42.16.3.05"}]
[null,"SC","São João do Itaperiú","SC - São João do Itaperiú",{"v":4216354,"d":"42.16.3.54"}]
[null,"SC","São João do Oeste","SC - São João do Oeste",{"v":4216255,"d":"42.16.2.55"}]
[null,"SC","São João do Sul","SC - São João do Sul",{"v":4216404,"d":"42.16.4.04"}]
[null,"SC","São Joaquim","SC - São Joaquim",{"v":4216503,"d":"42.16.5.03"}]
[null,"SC","São José","SC - São José",{"v":4216602,"d":"42.16.6.02"}]
[null,"SC","São José do Cedro","SC - São José do Cedro",{"v":4216701,"d":"42.16.7.01"}]
[null,"SC","São José do Cerrito","SC - São José do Cerrito",{"v":4216800,"d":"42.16.8.00"}]
[null,"SC","São Lourenço do Oeste","SC - São Lourenço do Oeste",{"v":4216909,"d":"42.16.9.09"}]
[null,"SC","São Ludgero","SC - São Ludgero",{"v":4217006,"d":"42.17.0.06"}]
[null,"SC","São Martinho","SC - São Martinho",{"v":4217105,"d":"42.17.1.05"}]
[null,"SC","São Miguel da Boa Vista","SC - São Miguel da Boa Vista",{"v":4217154,"d":"42.17.1.54"}]
[null,"SC","São Miguel do Oeste","SC - São Miguel do Oeste",{"v":4217204,"d":"42.17.2.04"}]
[null,"SC","São Pedro de Alcântara",{"$f":"CONCATENATE(B4703,\" - \",C4703)","v":"SC - São Pedro de Alcântara"},{"v":4217253,"d":"42.17.2.53"}]
[null,"SC","Saudades","SC - Saudades",{"v":4217303,"d":"42.17.3.03"}]
[null,"SC","Schroeder","SC - Schroeder",{"v":4217402,"d":"42.17.4.02"}]
[null,"SC","Seara","SC - Seara",{"v":4217501,"d":"42.17.5.01"}]
[null,"SC","Serra Alta","SC - Serra Alta",{"v":4217550,"d":"42.17.5.50"}]
[null,"SC","Siderópolis","SC - Siderópolis",{"v":4217600,"d":"42.17.6.00"}]
[null,"SC","Sombrio","SC - Sombrio",{"v":4217709,"d":"42.17.7.09"}]
[null,"SC","Sul Brasil","SC - Sul Brasil",{"v":4217758,"d":"42.17.7.58"}]
[null,"SC","Taió","SC - Taió",{"v":4217808,"d":"42.17.8.08"}]
[null,"SC","Tangará","SC - Tangará",{"v":4217907,"d":"42.17.9.07"}]
[null,"SC","Tigrinhos","SC - Tigrinhos",{"v":4217956,"d":"42.17.9.56"}]
[null,"SC","Tijucas","SC - Tijucas",{"v":4218004,"d":"42.18.0.04"}]
[null,"SC","Timbé do Sul","SC - Timbé do Sul",{"v":4218103,"d":"42.18.1.03"}]
[null,"SC","Timbó","SC - Timbó",{"v":4218202,"d":"42.18.2.02"}]
[null,"SC","Timbó Grande","SC - Timbó Grande",{"v":4218251,"d":"42.18.2.51"}]
[null,"SC","Três Barras","SC - Três Barras",{"v":4218301,"d":"42.18.3.01"}]
[null,"SC","Treviso","SC - Treviso",{"v":4218350,"d":"42.18.3.50"}]
[null,"SC","Treze de Maio","SC - Treze de Maio",{"v":4218400,"d":"42.18.4.00"}]
[null,"SC","Treze Tílias","SC - Treze Tílias",{"v":4218509,"d":"42.18.5.09"}]
[null,"SC","Trombudo Central","SC - Trombudo Central",{"v":4218608,"d":"42.18.6.08"}]
[null,"SC","Tubarão","SC - Tubarão",{"v":4218707,"d":"42.18.7.07"}]
[null,"SC","Tunápolis","SC - Tunápolis",{"v":4218756,"d":"42.18.7.56"}]
[null,"SC","Turvo","SC - Turvo",{"v":4218806,"d":"42.18.8.06"}]
[null,"SC","União do Oeste","SC - União do Oeste",{"v":4218855,"d":"42.18.8.55"}]
[null,"SC","Urubici","SC - Urubici",{"v":4218905,"d":"42.18.9.05"}]
[null,"SC","Urupema","SC - Urupema",{"v":4218954,"d":"42.18.9.54"}]
[null,"SC","Urussanga","SC - Urussanga",{"v":4219002,"d":"42.19.0.02"}]
[null,"SC","Vargeão","SC - Vargeão",{"v":4219101,"d":"42.19.1.01"}]
[null,"SC","Vargem","SC - Vargem",{"v":4219150,"d":"42.19.1.50"}]
[null,"SC","Vargem Bonita","SC - Vargem Bonita",{"v":4219176,"d":"42.19.1.76"}]
[null,"SC","Vidal Ramos","SC - Vidal Ramos",{"v":4219200,"d":"42.19.2.00"}]
[null,"SC","Videira","SC - Videira",{"v":4219309,"d":"42.19.3.09"}]
[null,"SC","Vitor Meireles","SC - Vitor Meireles",{"v":4219358,"d":"42.19.3.58"}]
[null,"SC","Witmarsum","SC - Witmarsum",{"v":4219408,"d":"42.19.4.08"}]
[null,"SC","Xanxerê","SC - Xanxerê",{"v":4219507,"d":"42.19.5.07"}]
[null,"SC","Xavantina","SC - Xavantina",{"v":4219606,"d":"42.19.6.06"}]
[null,"SC","Xaxim","SC - Xaxim",{"v":4219705,"d":"42.19.7.05"}]
[null,"SC","Zortéa","SC - Zortéa",{"v":4219853,"d":"42.19.8.53"}]
[null,"SE","Amparo de São Francisco","SE - Amparo de São Francisco",{"v":2800100,"d":"28.00.1.00"}]
[null,"SE","Aquidabã","SE - Aquidabã",{"v":2800209,"d":"28.00.2.09"}]
[null,"SE","Aracaju","SE - Aracaju",{"v":2800308,"d":"28.00.3.08"}]
[null,"SE","Arauá","SE - Arauá",{"v":2800407,"d":"28.00.4.07"}]
[null,"SE","Areia Branca","SE - Areia Branca",{"v":2800506,"d":"28.00.5.06"}]
[null,"SE","Barra dos Coqueiros","SE - Barra dos Coqueiros",{"v":2800605,"d":"28.00.6.05"}]
[null,"SE","Boquim","SE - Boquim",{"v":2800670,"d":"28.00.6.70"}]
[null,"SE","Brejo Grande","SE - Brejo Grande",{"v":2800704,"d":"28.00.7.04"}]
[null,"SE","Campo do Brito","SE - Campo do Brito",{"v":2801009,"d":"28.01.0.09"}]
[null,"SE","Canhoba","SE - Canhoba",{"v":2801108,"d":"28.01.1.08"}]
[null,"SE","Canindé de São Francisco","SE - Canindé de São Francisco",{"v":2801207,"d":"28.01.2.07"}]
[null,"SE","Capela","SE - Capela",{"v":2801306,"d":"28.01.3.06"}]
[null,"SE","Carira","SE - Carira",{"v":2801405,"d":"28.01.4.05"}]
[null,"SE","Carmópolis","SE - Carmópolis",{"v":2801504,"d":"28.01.5.04"}]
[null,"SE","Cedro de São João","SE - Cedro de São João",{"v":2801603,"d":"28.01.6.03"}]
[null,"SE","Cristinápolis","SE - Cristinápolis",{"v":2801702,"d":"28.01.7.02"}]
[null,"SE","Cumbe","SE - Cumbe",{"v":2801900,"d":"28.01.9.00"}]
[null,"SE","Divina Pastora","SE - Divina Pastora",{"v":2802007,"d":"28.02.0.07"}]
[null,"SE","Estância","SE - Estância",{"v":2802106,"d":"28.02.1.06"}]
[null,"SE","Feira Nova","SE - Feira Nova",{"v":2802205,"d":"28.02.2.05"}]
[null,"SE","Frei Paulo","SE - Frei Paulo",{"v":2802304,"d":"28.02.3.04"}]
[null,"SE","Gararu","SE - Gararu",{"v":2802403,"d":"28.02.4.03"}]
[null,"SE","General Maynard","SE - General Maynard",{"v":2802502,"d":"28.02.5.02"}]
[null,"SE","Gracho Cardoso","SE - Gracho Cardoso",{"v":2802601,"d":"28.02.6.01"}]
[null,"SE","Ilha das Flores","SE - Ilha das Flores",{"v":2802700,"d":"28.02.7.00"}]
[null,"SE","Indiaroba","SE - Indiaroba",{"v":2802809,"d":"28.02.8.09"}]
[null,"SE","Itabaiana",{"$f":"CONCATENATE(B4767,\" - \",C4767)","v":"SE - Itabaiana"},{"v":2802908,"d":"28.02.9.08"}]
[null,"SE","Itabaianinha","SE - Itabaianinha",{"v":2803005,"d":"28.03.0.05"}]
[null,"SE","Itabi","SE - Itabi",{"v":2803104,"d":"28.03.1.04"}]
[null,"SE","Itaporanga d'Ajuda","SE - Itaporanga d'Ajuda",{"v":2803203,"d":"28.03.2.03"}]
[null,"SE","Japaratuba","SE - Japaratuba",{"v":2803302,"d":"28.03.3.02"}]
[null,"SE","Japoatã","SE - Japoatã",{"v":2803401,"d":"28.03.4.01"}]
[null,"SE","Lagarto","SE - Lagarto",{"v":2803500,"d":"28.03.5.00"}]
[null,"SE","Laranjeiras","SE - Laranjeiras",{"v":2803609,"d":"28.03.6.09"}]
[null,"SE","Macambira","SE - Macambira",{"v":2803708,"d":"28.03.7.08"}]
[null,"SE","Malhada dos Bois","SE - Malhada dos Bois",{"v":2803807,"d":"28.03.8.07"}]
[null,"SE","Malhador","SE - Malhador",{"v":2803906,"d":"28.03.9.06"}]
[null,"SE","Maruim","SE - Maruim",{"v":2804003,"d":"28.04.0.03"}]
[null,"SE","Moita Bonita","SE - Moita Bonita",{"v":2804102,"d":"28.04.1.02"}]
[null,"SE","Monte Alegre de Sergipe","SE - Monte Alegre de Sergipe",{"v":2804201,"d":"28.04.2.01"}]
[null,"SE","Muribeca","SE - Muribeca",{"v":2804300,"d":"28.04.3.00"}]
[null,"SE","Neópolis","SE - Neópolis",{"v":2804409,"d":"28.04.4.09"}]
[null,"SE","Nossa Senhora Aparecida","SE - Nossa Senhora Aparecida",{"v":2804458,"d":"28.04.4.58"}]
[null,"SE","Nossa Senhora da Glória","SE - Nossa Senhora da Glória",{"v":2804508,"d":"28.04.5.08"}]
[null,"SE","Nossa Senhora das Dores","SE - Nossa Senhora das Dores",{"v":2804607,"d":"28.04.6.07"}]
[null,"SE","Nossa Senhora de Lourdes","SE - Nossa Senhora de Lourdes",{"v":2804706,"d":"28.04.7.06"}]
[null,"SE","Nossa Senhora do Socorro","SE - Nossa Senhora do Socorro",{"v":2804805,"d":"28.04.8.05"}]
[null,"SE","Pacatuba","SE - Pacatuba",{"v":2804904,"d":"28.04.9.04"}]
[null,"SE","Pedra Mole","SE - Pedra Mole",{"v":2805000,"d":"28.05.0.00"}]
[null,"SE","Pedrinhas","SE - Pedrinhas",{"v":2805109,"d":"28.05.1.09"}]
[null,"SE","Pinhão","SE - Pinhão",{"v":2805208,"d":"28.05.2.08"}]
[null,"SE","Pirambu","SE - Pirambu",{"v":2805307,"d":"28.05.3.07"}]
[null,"SE","Poço Redondo","SE - Poço Redondo",{"v":2805406,"d":"28.05.4.06"}]
[null,"SE","Poço Verde","SE - Poço Verde",{"v":2805505,"d":"28.05.5.05"}]
[null,"SE","Porto da Folha","SE - Porto da Folha",{"v":2805604,"d":"28.05.6.04"}]
[null,"SE","Propriá","SE - Propriá",{"v":2805703,"d":"28.05.7.03"}]
[null,"SE","Riachão do Dantas","SE - Riachão do Dantas",{"v":2805802,"d":"28.05.8.02"}]
[null,"SE","Riachuelo","SE - Riachuelo",{"v":2805901,"d":"28.05.9.01"}]
[null,"SE","Ribeirópolis","SE - Ribeirópolis",{"v":2806008,"d":"28.06.0.08"}]
[null,"SE","Rosário do Catete","SE - Rosário do Catete",{"v":2806107,"d":"28.06.1.07"}]
[null,"SE","Salgado","SE - Salgado",{"v":2806206,"d":"28.06.2.06"}]
[null,"SE","Santa Luzia do Itanhy","SE - Santa Luzia do Itanhy",{"v":2806305,"d":"28.06.3.05"}]
[null,"SE","Santa Rosa de Lima","SE - Santa Rosa de Lima",{"v":2806503,"d":"28.06.5.03"}]
[null,"SE","Santana do São Francisco","SE - Santana do São Francisco",{"v":2806404,"d":"28.06.4.04"}]
[null,"SE","Santo Amaro das Brotas","SE - Santo Amaro das Brotas",{"v":2806602,"d":"28.06.6.02"}]
[null,"SE","São Cristóvão","SE - São Cristóvão",{"v":2806701,"d":"28.06.7.01"}]
[null,"SE","São Domingos","SE - São Domingos",{"v":2806800,"d":"28.06.8.00"}]
[null,"SE","São Francisco","SE - São Francisco",{"v":2806909,"d":"28.06.9.09"}]
[null,"SE","São Miguel do Aleixo","SE - São Miguel do Aleixo",{"v":2807006,"d":"28.07.0.06"}]
[null,"SE","Simão Dias","SE - Simão Dias",{"v":2807105,"d":"28.07.1.05"}]
[null,"SE","Siriri","SE - Siriri",{"v":2807204,"d":"28.07.2.04"}]
[null,"SE","Telha","SE - Telha",{"v":2807303,"d":"28.07.3.03"}]
[null,"SE","Tobias Barreto","SE - Tobias Barreto",{"v":2807402,"d":"28.07.4.02"}]
[null,"SE","Tomar do Geru","SE - Tomar do Geru",{"v":2807501,"d":"28.07.5.01"}]
[null,"SE","Umbaúba","SE - Umbaúba",{"v":2807600,"d":"28.07.6.00"}]
[null,"SP","Adamantina","SP - Adamantina",{"v":3500105,"d":"35.00.1.05"}]
[null,"SP","Adolfo","SP - Adolfo",{"v":3500204,"d":"35.00.2.04"}]
[null,"SP","Aguaí","SP - Aguaí",{"v":3500303,"d":"35.00.3.03"}]
[null,"SP","Águas da Prata","SP - Águas da Prata",{"v":3500402,"d":"35.00.4.02"}]
[null,"SP","Águas de Lindóia","SP - Águas de Lindóia",{"v":3500501,"d":"35.00.5.01"}]
[null,"SP","Águas de Santa Bárbara","SP - Águas de Santa Bárbara",{"v":3500550,"d":"35.00.5.50"}]
[null,"SP","Águas de São Pedro","SP - Águas de São Pedro",{"v":3500600,"d":"35.00.6.00"}]
[null,"SP","Agudos","SP - Agudos",{"v":3500709,"d":"35.00.7.09"}]
[null,"SP","Alambari","SP - Alambari",{"v":3500758,"d":"35.00.7.58"}]
[null,"SP","Alfredo Marcondes","SP - Alfredo Marcondes",{"v":3500808,"d":"35.00.8.08"}]
[null,"SP","Altair","SP - Altair",{"v":3500907,"d":"35.00.9.07"}]
[null,"SP","Altinópolis","SP - Altinópolis",{"v":3501004,"d":"35.01.0.04"}]
[null,"SP","Alto Alegre","SP - Alto Alegre",{"v":3501103,"d":"35.01.1.03"}]
[null,"SP","Alumínio","SP - Alumínio",{"v":3501152,"d":"35.01.1.52"}]
[null,"SP","Álvares Florence","SP - Álvares Florence",{"v":3501202,"d":"35.01.2.02"}]
[null,"SP","Álvares Machado",{"$f":"CONCATENATE(B4831,\" - \",C4831)","v":"SP - Álvares Machado"},{"v":3501301,"d":"35.01.3.01"}]
[null,"SP","Álvaro de Carvalho","SP - Álvaro de Carvalho",{"v":3501400,"d":"35.01.4.00"}]
[null,"SP","Alvinlândia","SP - Alvinlândia",{"v":3501509,"d":"35.01.5.09"}]
[null,"SP","Americana","SP - Americana",{"v":3501608,"d":"35.01.6.08"}]
[null,"SP","Américo Brasiliense","SP - Américo Brasiliense",{"v":3501707,"d":"35.01.7.07"}]
[null,"SP","Américo de Campos","SP - Américo de Campos",{"v":3501806,"d":"35.01.8.06"}]
[null,"SP","Amparo","SP - Amparo",{"v":3501905,"d":"35.01.9.05"}]
[null,"SP","Analândia","SP - Analândia",{"v":3502002,"d":"35.02.0.02"}]
[null,"SP","Andradina","SP - Andradina",{"v":3502101,"d":"35.02.1.01"}]
[null,"SP","Angatuba","SP - Angatuba",{"v":3502200,"d":"35.02.2.00"}]
[null,"SP","Anhembi","SP - Anhembi",{"v":3502309,"d":"35.02.3.09"}]
[null,"SP","Anhumas","SP - Anhumas",{"v":3502408,"d":"35.02.4.08"}]
[null,"SP","Aparecida","SP - Aparecida",{"v":3502507,"d":"35.02.5.07"}]
[null,"SP","Aparecida d'Oeste","SP - Aparecida d'Oeste",{"v":3502606,"d":"35.02.6.06"}]
[null,"SP","Apiaí","SP - Apiaí",{"v":3502705,"d":"35.02.7.05"}]
[null,"SP","Araçariguama","SP - Araçariguama",{"v":3502754,"d":"35.02.7.54"}]
[null,"SP","Araçatuba","SP - Araçatuba",{"v":3502804,"d":"35.02.8.04"}]
[null,"SP","Araçoiaba da Serra","SP - Araçoiaba da Serra",{"v":3502903,"d":"35.02.9.03"}]
[null,"SP","Aramina","SP - Aramina",{"v":3503000,"d":"35.03.0.00"}]
[null,"SP","Arandu","SP - Arandu",{"v":3503109,"d":"35.03.1.09"}]
[null,"SP","Arapeí","SP - Arapeí",{"v":3503158,"d":"35.03.1.58"}]
[null,"SP","Araraquara","SP - Araraquara",{"v":3503208,"d":"35.03.2.08"}]
[null,"SP","Araras","SP - Araras",{"v":3503307,"d":"35.03.3.07"}]
[null,"SP","Arco-Íris","SP - Arco-Íris",{"v":3503356,"d":"35.03.3.56"}]
[null,"SP","Arealva","SP - Arealva",{"v":3503406,"d":"35.03.4.06"}]
[null,"SP","Areias","SP - Areias",{"v":3503505,"d":"35.03.5.05"}]
[null,"SP","Areiópolis","SP - Areiópolis",{"v":3503604,"d":"35.03.6.04"}]
[null,"SP","Ariranha","SP - Ariranha",{"v":3503703,"d":"35.03.7.03"}]
[null,"SP","Artur Nogueira","SP - Artur Nogueira",{"v":3503802,"d":"35.03.8.02"}]
[null,"SP","Arujá","SP - Arujá",{"v":3503901,"d":"35.03.9.01"}]
[null,"SP","Aspásia","SP - Aspásia",{"v":3503950,"d":"35.03.9.50"}]
[null,"SP","Assis","SP - Assis",{"v":3504008,"d":"35.04.0.08"}]
[null,"SP","Atibaia","SP - Atibaia",{"v":3504107,"d":"35.04.1.07"}]
[null,"SP","Auriflama","SP - Auriflama",{"v":3504206,"d":"35.04.2.06"}]
[null,"SP","Avaí","SP - Avaí",{"v":3504305,"d":"35.04.3.05"}]
[null,"SP","Avanhandava","SP - Avanhandava",{"v":3504404,"d":"35.04.4.04"}]
[null,"SP","Avaré","SP - Avaré",{"v":3504503,"d":"35.04.5.03"}]
[null,"SP","Bady Bassitt","SP - Bady Bassitt",{"v":3504602,"d":"35.04.6.02"}]
[null,"SP","Balbinos","SP - Balbinos",{"v":3504701,"d":"35.04.7.01"}]
[null,"SP","Bálsamo","SP - Bálsamo",{"v":3504800,"d":"35.04.8.00"}]
[null,"SP","Bananal","SP - Bananal",{"v":3504909,"d":"35.04.9.09"}]
[null,"SP","Barão de Antonina","SP - Barão de Antonina",{"v":3505005,"d":"35.05.0.05"}]
[null,"SP","Barbosa","SP - Barbosa",{"v":3505104,"d":"35.05.1.04"}]
[null,"SP","Bariri","SP - Bariri",{"v":3505203,"d":"35.05.2.03"}]
[null,"SP","Barra Bonita","SP - Barra Bonita",{"v":3505302,"d":"35.05.3.02"}]
[null,"SP","Barra do Chapéu","SP - Barra do Chapéu",{"v":3505351,"d":"35.05.3.51"}]
[null,"SP","Barra do Turvo","SP - Barra do Turvo",{"v":3505401,"d":"35.05.4.01"}]
[null,"SP","Barretos","SP - Barretos",{"v":3505500,"d":"35.05.5.00"}]
[null,"SP","Barrinha","SP - Barrinha",{"v":3505609,"d":"35.05.6.09"}]
[null,"SP","Barueri","SP - Barueri",{"v":3505708,"d":"35.05.7.08"}]
[null,"SP","Bastos","SP - Bastos",{"v":3505807,"d":"35.05.8.07"}]
[null,"SP","Batatais","SP - Batatais",{"v":3505906,"d":"35.05.9.06"}]
[null,"SP","Bauru","SP - Bauru",{"v":3506003,"d":"35.06.0.03"}]
[null,"SP","Bebedouro","SP - Bebedouro",{"v":3506102,"d":"35.06.1.02"}]
[null,"SP","Bento de Abreu","SP - Bento de Abreu",{"v":3506201,"d":"35.06.2.01"}]
[null,"SP","Bernardino de Campos","SP - Bernardino de Campos",{"v":3506300,"d":"35.06.3.00"}]
[null,"SP","Bertioga","SP - Bertioga",{"v":3506359,"d":"35.06.3.59"}]
[null,"SP","Bilac","SP - Bilac",{"v":3506409,"d":"35.06.4.09"}]
[null,"SP","Birigui","SP - Birigui",{"v":3506508,"d":"35.06.5.08"}]
[null,"SP","Biritiba-Mirim","SP - Biritiba-Mirim",{"v":3506607,"d":"35.06.6.07"}]
[null,"SP","Boa Esperança do Sul","SP - Boa Esperança do Sul",{"v":3506706,"d":"35.06.7.06"}]
[null,"SP","Bocaina","SP - Bocaina",{"v":3506805,"d":"35.06.8.05"}]
[null,"SP","Bofete","SP - Bofete",{"v":3506904,"d":"35.06.9.04"}]
[null,"SP","Boituva","SP - Boituva",{"v":3507001,"d":"35.07.0.01"}]
[null,"SP","Bom Jesus dos Perdões",{"$f":"CONCATENATE(B4895,\" - \",C4895)","v":"SP - Bom Jesus dos Perdões"},{"v":3507100,"d":"35.07.1.00"}]
[null,"SP","Bom Sucesso de Itararé","SP - Bom Sucesso de Itararé",{"v":3507159,"d":"35.07.1.59"}]
[null,"SP","Borá","SP - Borá",{"v":3507209,"d":"35.07.2.09"}]
[null,"SP","Boracéia","SP - Boracéia",{"v":3507308,"d":"35.07.3.08"}]
[null,"SP","Borborema","SP - Borborema",{"v":3507407,"d":"35.07.4.07"}]
[null,"SP","Borebi","SP - Borebi",{"v":3507456,"d":"35.07.4.56"}]
[null,"SP","Botucatu","SP - Botucatu",{"v":3507506,"d":"35.07.5.06"}]
[null,"SP","Bragança Paulista","SP - Bragança Paulista",{"v":3507605,"d":"35.07.6.05"}]
[null,"SP","Braúna","SP - Braúna",{"v":3507704,"d":"35.07.7.04"}]
[null,"SP","Brejo Alegre","SP - Brejo Alegre",{"v":3507753,"d":"35.07.7.53"}]
[null,"SP","Brodowski","SP - Brodowski",{"v":3507803,"d":"35.07.8.03"}]
[null,"SP","Brotas","SP - Brotas",{"v":3507902,"d":"35.07.9.02"}]
[null,"SP","Buri","SP - Buri",{"v":3508009,"d":"35.08.0.09"}]
[null,"SP","Buritama","SP - Buritama",{"v":3508108,"d":"35.08.1.08"}]
[null,"SP","Buritizal","SP - Buritizal",{"v":3508207,"d":"35.08.2.07"}]
[null,"SP","Cabrália Paulista","SP - Cabrália Paulista",{"v":3508306,"d":"35.08.3.06"}]
[null,"SP","Cabreúva","SP - Cabreúva",{"v":3508405,"d":"35.08.4.05"}]
[null,"SP","Caçapava","SP - Caçapava",{"v":3508504,"d":"35.08.5.04"}]
[null,"SP","Cachoeira Paulista","SP - Cachoeira Paulista",{"v":3508603,"d":"35.08.6.03"}]
[null,"SP","Caconde","SP - Caconde",{"v":3508702,"d":"35.08.7.02"}]
[null,"SP","Cafelândia","SP - Cafelândia",{"v":3508801,"d":"35.08.8.01"}]
[null,"SP","Caiabu","SP - Caiabu",{"v":3508900,"d":"35.08.9.00"}]
[null,"SP","Caieiras","SP - Caieiras",{"v":3509007,"d":"35.09.0.07"}]
[null,"SP","Caiuá","SP - Caiuá",{"v":3509106,"d":"35.09.1.06"}]
[null,"SP","Cajamar","SP - Cajamar",{"v":3509205,"d":"35.09.2.05"}]
[null,"SP","Cajati","SP - Cajati",{"v":3509254,"d":"35.09.2.54"}]
[null,"SP","Cajobi","SP - Cajobi",{"v":3509304,"d":"35.09.3.04"}]
[null,"SP","Cajuru","SP - Cajuru",{"v":3509403,"d":"35.09.4.03"}]
[null,"SP","Campina do Monte Alegre","SP - Campina do Monte Alegre",{"v":3509452,"d":"35.09.4.52"}]
[null,"SP","Campinas","SP - Campinas",{"v":3509502,"d":"35.09.5.02"}]
[null,"SP","Campo Limpo Paulista","SP - Campo Limpo Paulista",{"v":3509601,"d":"35.09.6.01"}]
[null,"SP","Campos do Jordão","SP - Campos do Jordão",{"v":3509700,"d":"35.09.7.00"}]
[null,"SP","Campos Novos Paulista","SP - Campos Novos Paulista",{"v":3509809,"d":"35.09.8.09"}]
[null,"SP","Cananéia","SP - Cananéia",{"v":3509908,"d":"35.09.9.08"}]
[null,"SP","Canas","SP - Canas",{"v":3509957,"d":"35.09.9.57"}]
[null,"SP","Cândido Mota","SP - Cândido Mota",{"v":3510005,"d":"35.10.0.05"}]
[null,"SP","Cândido Rodrigues","SP - Cândido Rodrigues",{"v":3510104,"d":"35.10.1.04"}]
[null,"SP","Canitar","SP - Canitar",{"v":3510153,"d":"35.10.1.53"}]
[null,"SP","Capão Bonito","SP - Capão Bonito",{"v":3510203,"d":"35.10.2.03"}]
[null,"SP","Capela do Alto","SP - Capela do Alto",{"v":3510302,"d":"35.10.3.02"}]
[null,"SP","Capivari","SP - Capivari",{"v":3510401,"d":"35.10.4.01"}]
[null,"SP","Caraguatatuba","SP - Caraguatatuba",{"v":3510500,"d":"35.10.5.00"}]
[null,"SP","Carapicuíba","SP - Carapicuíba",{"v":3510609,"d":"35.10.6.09"}]
[null,"SP","Cardoso","SP - Cardoso",{"v":3510708,"d":"35.10.7.08"}]
[null,"SP","Casa Branca","SP - Casa Branca",{"v":3510807,"d":"35.10.8.07"}]
[null,"SP","Cássia dos Coqueiros","SP - Cássia dos Coqueiros",{"v":3510906,"d":"35.10.9.06"}]
[null,"SP","Castilho","SP - Castilho",{"v":3511003,"d":"35.11.0.03"}]
[null,"SP","Catanduva","SP - Catanduva",{"v":3511102,"d":"35.11.1.02"}]
[null,"SP","Catiguá","SP - Catiguá",{"v":3511201,"d":"35.11.2.01"}]
[null,"SP","Cedral","SP - Cedral",{"v":3511300,"d":"35.11.3.00"}]
[null,"SP","Cerqueira César","SP - Cerqueira César",{"v":3511409,"d":"35.11.4.09"}]
[null,"SP","Cerquilho","SP - Cerquilho",{"v":3511508,"d":"35.11.5.08"}]
[null,"SP","Cesário Lange","SP - Cesário Lange",{"v":3511607,"d":"35.11.6.07"}]
[null,"SP","Charqueada","SP - Charqueada",{"v":3511706,"d":"35.11.7.06"}]
[null,"SP","Chavantes","SP - Chavantes",{"v":3557204,"d":"35.57.2.04"}]
[null,"SP","Clementina","SP - Clementina",{"v":3511904,"d":"35.11.9.04"}]
[null,"SP","Colina","SP - Colina",{"v":3512001,"d":"35.12.0.01"}]
[null,"SP","Colômbia","SP - Colômbia",{"v":3512100,"d":"35.12.1.00"}]
[null,"SP","Conchal","SP - Conchal",{"v":3512209,"d":"35.12.2.09"}]
[null,"SP","Conchas","SP - Conchas",{"v":3512308,"d":"35.12.3.08"}]
[null,"SP","Cordeirópolis","SP - Cordeirópolis",{"v":3512407,"d":"35.12.4.07"}]
[null,"SP","Coroados","SP - Coroados",{"v":3512506,"d":"35.12.5.06"}]
[null,"SP","Coronel Macedo","SP - Coronel Macedo",{"v":3512605,"d":"35.12.6.05"}]
[null,"SP","Corumbataí","SP - Corumbataí",{"v":3512704,"d":"35.12.7.04"}]
[null,"SP","Cosmópolis",{"$f":"CONCATENATE(B4959,\" - \",C4959)","v":"SP - Cosmópolis"},{"v":3512803,"d":"35.12.8.03"}]
[null,"SP","Cosmorama","SP - Cosmorama",{"v":3512902,"d":"35.12.9.02"}]
[null,"SP","Cotia","SP - Cotia",{"v":3513009,"d":"35.13.0.09"}]
[null,"SP","Cravinhos","SP - Cravinhos",{"v":3513108,"d":"35.13.1.08"}]
[null,"SP","Cristais Paulista","SP - Cristais Paulista",{"v":3513207,"d":"35.13.2.07"}]
[null,"SP","Cruzália","SP - Cruzália",{"v":3513306,"d":"35.13.3.06"}]
[null,"SP","Cruzeiro","SP - Cruzeiro",{"v":3513405,"d":"35.13.4.05"}]
[null,"SP","Cubatão","SP - Cubatão",{"v":3513504,"d":"35.13.5.04"}]
[null,"SP","Cunha","SP - Cunha",{"v":3513603,"d":"35.13.6.03"}]
[null,"SP","Descalvado","SP - Descalvado",{"v":3513702,"d":"35.13.7.02"}]
[null,"SP","Diadema","SP - Diadema",{"v":3513801,"d":"35.13.8.01"}]
[null,"SP","Dirce Reis","SP - Dirce Reis",{"v":3513850,"d":"35.13.8.50"}]
[null,"SP","Divinolândia","SP - Divinolândia",{"v":3513900,"d":"35.13.9.00"}]
[null,"SP","Dobrada","SP - Dobrada",{"v":3514007,"d":"35.14.0.07"}]
[null,"SP","Dois Córregos","SP - Dois Córregos",{"v":3514106,"d":"35.14.1.06"}]
[null,"SP","Dolcinópolis","SP - Dolcinópolis",{"v":3514205,"d":"35.14.2.05"}]
[null,"SP","Dourado","SP - Dourado",{"v":3514304,"d":"35.14.3.04"}]
[null,"SP","Dracena","SP - Dracena",{"v":3514403,"d":"35.14.4.03"}]
[null,"SP","Duartina","SP - Duartina",{"v":3514502,"d":"35.14.5.02"}]
[null,"SP","Dumont","SP - Dumont",{"v":3514601,"d":"35.14.6.01"}]
[null,"SP","Echaporã","SP - Echaporã",{"v":3514700,"d":"35.14.7.00"}]
[null,"SP","Eldorado","SP - Eldorado",{"v":3514809,"d":"35.14.8.09"}]
[null,"SP","Elias Fausto","SP - Elias Fausto",{"v":3514908,"d":"35.14.9.08"}]
[null,"SP","Elisiário","SP - Elisiário",{"v":3514924,"d":"35.14.9.24"}]
[null,"SP","Embaúba","SP - Embaúba",{"v":3514957,"d":"35.14.9.57"}]
[null,"SP","Embu","SP - Embu",{"v":3515004,"d":"35.15.0.04"}]
[null,"SP","Embu-Guaçu","SP - Embu-Guaçu",{"v":3515103,"d":"35.15.1.03"}]
[null,"SP","Emilianópolis","SP - Emilianópolis",{"v":3515129,"d":"35.15.1.29"}]
[null,"SP","Engenheiro Coelho","SP - Engenheiro Coelho",{"v":3515152,"d":"35.15.1.52"}]
[null,"SP","Espírito Santo do Pinhal","SP - Espírito Santo do Pinhal",{"v":3515186,"d":"35.15.1.86"}]
[null,"SP","Espírito Santo do Turvo","SP - Espírito Santo do Turvo",{"v":3515194,"d":"35.15.1.94"}]
[null,"SP","Estiva Gerbi","SP - Estiva Gerbi",{"v":3557303,"d":"35.57.3.03"}]
[null,"SP","Estrela do Norte","SP - Estrela do Norte",{"v":3515301,"d":"35.15.3.01"}]
[null,"SP","Estrela d'Oeste","SP - Estrela d'Oeste",{"v":3515202,"d":"35.15.2.02"}]
[null,"SP","Euclides da Cunha Paulista","SP - Euclides da Cunha Paulista",{"v":3515350,"d":"35.15.3.50"}]
[null,"SP","Fartura","SP - Fartura",{"v":3515400,"d":"35.15.4.00"}]
[null,"SP","Fernando Prestes","SP - Fernando Prestes",{"v":3515608,"d":"35.15.6.08"}]
[null,"SP","Fernandópolis","SP - Fernandópolis",{"v":3515509,"d":"35.15.5.09"}]
[null,"SP","Fernão","SP - Fernão",{"v":3515657,"d":"35.15.6.57"}]
[null,"SP","Ferraz de Vasconcelos","SP - Ferraz de Vasconcelos",{"v":3515707,"d":"35.15.7.07"}]
[null,"SP","Flora Rica","SP - Flora Rica",{"v":3515806,"d":"35.15.8.06"}]
[null,"SP","Floreal","SP - Floreal",{"v":3515905,"d":"35.15.9.05"}]
[null,"SP","Flórida Paulista","SP - Flórida Paulista",{"v":3516002,"d":"35.16.0.02"}]
[null,"SP","Florínia","SP - Florínia",{"v":3516101,"d":"35.16.1.01"}]
[null,"SP","Franca","SP - Franca",{"v":3516200,"d":"35.16.2.00"}]
[null,"SP","Francisco Morato","SP - Francisco Morato",{"v":3516309,"d":"35.16.3.09"}]
[null,"SP","Franco da Rocha","SP - Franco da Rocha",{"v":3516408,"d":"35.16.4.08"}]
[null,"SP","Gabriel Monteiro","SP - Gabriel Monteiro",{"v":3516507,"d":"35.16.5.07"}]
[null,"SP","Gália","SP - Gália",{"v":3516606,"d":"35.16.6.06"}]
[null,"SP","Garça","SP - Garça",{"v":3516705,"d":"35.16.7.05"}]
[null,"SP","Gastão Vidigal","SP - Gastão Vidigal",{"v":3516804,"d":"35.16.8.04"}]
[null,"SP","Gavião Peixoto","SP - Gavião Peixoto",{"v":3516853,"d":"35.16.8.53"}]
[null,"SP","General Salgado","SP - General Salgado",{"v":3516903,"d":"35.16.9.03"}]
[null,"SP","Getulina","SP - Getulina",{"v":3517000,"d":"35.17.0.00"}]
[null,"SP","Glicério","SP - Glicério",{"v":3517109,"d":"35.17.1.09"}]
[null,"SP","Guaiçara","SP - Guaiçara",{"v":3517208,"d":"35.17.2.08"}]
[null,"SP","Guaimbê","SP - Guaimbê",{"v":3517307,"d":"35.17.3.07"}]
[null,"SP","Guaíra","SP - Guaíra",{"v":3517406,"d":"35.17.4.06"}]
[null,"SP","Guapiaçu","SP - Guapiaçu",{"v":3517505,"d":"35.17.5.05"}]
[null,"SP","Guapiara","SP - Guapiara",{"v":3517604,"d":"35.17.6.04"}]
[null,"SP","Guará","SP - Guará",{"v":3517703,"d":"35.17.7.03"}]
[null,"SP","Guaraçaí","SP - Guaraçaí",{"v":3517802,"d":"35.17.8.02"}]
[null,"SP","Guaraci","SP - Guaraci",{"v":3517901,"d":"35.17.9.01"}]
[null,"SP","Guarani d'Oeste","SP - Guarani d'Oeste",{"v":3518008,"d":"35.18.0.08"}]
[null,"SP","Guarantã",{"$f":"CONCATENATE(B5023,\" - \",C5023)","v":"SP - Guarantã"},{"v":3518107,"d":"35.18.1.07"}]
[null,"SP","Guararapes","SP - Guararapes",{"v":3518206,"d":"35.18.2.06"}]
[null,"SP","Guararema","SP - Guararema",{"v":3518305,"d":"35.18.3.05"}]
[null,"SP","Guaratinguetá","SP - Guaratinguetá",{"v":3518404,"d":"35.18.4.04"}]
[null,"SP","Guareí","SP - Guareí",{"v":3518503,"d":"35.18.5.03"}]
[null,"SP","Guariba","SP - Guariba",{"v":3518602,"d":"35.18.6.02"}]
[null,"SP","Guarujá","SP - Guarujá",{"v":3518701,"d":"35.18.7.01"}]
[null,"SP","Guarulhos","SP - Guarulhos",{"v":3518800,"d":"35.18.8.00"}]
[null,"SP","Guatapará","SP - Guatapará",{"v":3518859,"d":"35.18.8.59"}]
[null,"SP","Guzolândia","SP - Guzolândia",{"v":3518909,"d":"35.18.9.09"}]
[null,"SP","Herculândia","SP - Herculândia",{"v":3519006,"d":"35.19.0.06"}]
[null,"SP","Holambra","SP - Holambra",{"v":3519055,"d":"35.19.0.55"}]
[null,"SP","Hortolândia","SP - Hortolândia",{"v":3519071,"d":"35.19.0.71"}]
[null,"SP","Iacanga","SP - Iacanga",{"v":3519105,"d":"35.19.1.05"}]
[null,"SP","Iacri","SP - Iacri",{"v":3519204,"d":"35.19.2.04"}]
[null,"SP","Iaras","SP - Iaras",{"v":3519253,"d":"35.19.2.53"}]
[null,"SP","Ibaté","SP - Ibaté",{"v":3519303,"d":"35.19.3.03"}]
[null,"SP","Ibirá","SP - Ibirá",{"v":3519402,"d":"35.19.4.02"}]
[null,"SP","Ibirarema","SP - Ibirarema",{"v":3519501,"d":"35.19.5.01"}]
[null,"SP","Ibitinga","SP - Ibitinga",{"v":3519600,"d":"35.19.6.00"}]
[null,"SP","Ibiúna","SP - Ibiúna",{"v":3519709,"d":"35.19.7.09"}]
[null,"SP","Icém","SP - Icém",{"v":3519808,"d":"35.19.8.08"}]
[null,"SP","Iepê","SP - Iepê",{"v":3519907,"d":"35.19.9.07"}]
[null,"SP","Igaraçu do Tietê","SP - Igaraçu do Tietê",{"v":3520004,"d":"35.20.0.04"}]
[null,"SP","Igarapava","SP - Igarapava",{"v":3520103,"d":"35.20.1.03"}]
[null,"SP","Igaratá","SP - Igaratá",{"v":3520202,"d":"35.20.2.02"}]
[null,"SP","Iguape","SP - Iguape",{"v":3520301,"d":"35.20.3.01"}]
[null,"SP","Ilha Comprida","SP - Ilha Comprida",{"v":3520426,"d":"35.20.4.26"}]
[null,"SP","Ilha Solteira","SP - Ilha Solteira",{"v":3520442,"d":"35.20.4.42"}]
[null,"SP","Ilhabela","SP - Ilhabela",{"v":3520400,"d":"35.20.4.00"}]
[null,"SP","Indaiatuba","SP - Indaiatuba",{"v":3520509,"d":"35.20.5.09"}]
[null,"SP","Indiana","SP - Indiana",{"v":3520608,"d":"35.20.6.08"}]
[null,"SP","Indiaporã","SP - Indiaporã",{"v":3520707,"d":"35.20.7.07"}]
[null,"SP","Inúbia Paulista","SP - Inúbia Paulista",{"v":3520806,"d":"35.20.8.06"}]
[null,"SP","Ipaussu","SP - Ipaussu",{"v":3520905,"d":"35.20.9.05"}]
[null,"SP","Iperó","SP - Iperó",{"v":3521002,"d":"35.21.0.02"}]
[null,"SP","Ipeúna","SP - Ipeúna",{"v":3521101,"d":"35.21.1.01"}]
[null,"SP","Ipiguá","SP - Ipiguá",{"v":3521150,"d":"35.21.1.50"}]
[null,"SP","Iporanga","SP - Iporanga",{"v":3521200,"d":"35.21.2.00"}]
[null,"SP","Ipuã","SP - Ipuã",{"v":3521309,"d":"35.21.3.09"}]
[null,"SP","Iracemápolis","SP - Iracemápolis",{"v":3521408,"d":"35.21.4.08"}]
[null,"SP","Irapuã","SP - Irapuã",{"v":3521507,"d":"35.21.5.07"}]
[null,"SP","Irapuru","SP - Irapuru",{"v":3521606,"d":"35.21.6.06"}]
[null,"SP","Itaberá","SP - Itaberá",{"v":3521705,"d":"35.21.7.05"}]
[null,"SP","Itaí","SP - Itaí",{"v":3521804,"d":"35.21.8.04"}]
[null,"SP","Itajobi","SP - Itajobi",{"v":3521903,"d":"35.21.9.03"}]
[null,"SP","Itaju","SP - Itaju",{"v":3522000,"d":"35.22.0.00"}]
[null,"SP","Itanhaém","SP - Itanhaém",{"v":3522109,"d":"35.22.1.09"}]
[null,"SP","Itaóca","SP - Itaóca",{"v":3522158,"d":"35.22.1.58"}]
[null,"SP","Itapecerica da Serra","SP - Itapecerica da Serra",{"v":3522208,"d":"35.22.2.08"}]
[null,"SP","Itapetininga","SP - Itapetininga",{"v":3522307,"d":"35.22.3.07"}]
[null,"SP","Itapeva","SP - Itapeva",{"v":3522406,"d":"35.22.4.06"}]
[null,"SP","Itapevi","SP - Itapevi",{"v":3522505,"d":"35.22.5.05"}]
[null,"SP","Itapira","SP - Itapira",{"v":3522604,"d":"35.22.6.04"}]
[null,"SP","Itapirapuã Paulista","SP - Itapirapuã Paulista",{"v":3522653,"d":"35.22.6.53"}]
[null,"SP","Itápolis","SP - Itápolis",{"v":3522703,"d":"35.22.7.03"}]
[null,"SP","Itaporanga","SP - Itaporanga",{"v":3522802,"d":"35.22.8.02"}]
[null,"SP","Itapuí","SP - Itapuí",{"v":3522901,"d":"35.22.9.01"}]
[null,"SP","Itapura","SP - Itapura",{"v":3523008,"d":"35.23.0.08"}]
[null,"SP","Itaquaquecetuba","SP - Itaquaquecetuba",{"v":3523107,"d":"35.23.1.07"}]
[null,"SP","Itararé","SP - Itararé",{"v":3523206,"d":"35.23.2.06"}]
[null,"SP","Itariri","SP - Itariri",{"v":3523305,"d":"35.23.3.05"}]
[null,"SP","Itatiba","SP - Itatiba",{"v":3523404,"d":"35.23.4.04"}]
[null,"SP","Itatinga","SP - Itatinga",{"v":3523503,"d":"35.23.5.03"}]
[null,"SP","Itirapina",{"$f":"CONCATENATE(B5087,\" - \",C5087)","v":"SP - Itirapina"},{"v":3523602,"d":"35.23.6.02"}]
[null,"SP","Itirapuã","SP - Itirapuã",{"v":3523701,"d":"35.23.7.01"}]
[null,"SP","Itobi","SP - Itobi",{"v":3523800,"d":"35.23.8.00"}]
[null,"SP","Itu","SP - Itu",{"v":3523909,"d":"35.23.9.09"}]
[null,"SP","Itupeva","SP - Itupeva",{"v":3524006,"d":"35.24.0.06"}]
[null,"SP","Ituverava","SP - Ituverava",{"v":3524105,"d":"35.24.1.05"}]
[null,"SP","Jaborandi","SP - Jaborandi",{"v":3524204,"d":"35.24.2.04"}]
[null,"SP","Jaboticabal","SP - Jaboticabal",{"v":3524303,"d":"35.24.3.03"}]
[null,"SP","Jacareí","SP - Jacareí",{"v":3524402,"d":"35.24.4.02"}]
[null,"SP","Jaci","SP - Jaci",{"v":3524501,"d":"35.24.5.01"}]
[null,"SP","Jacupiranga","SP - Jacupiranga",{"v":3524600,"d":"35.24.6.00"}]
[null,"SP","Jaguariúna","SP - Jaguariúna",{"v":3524709,"d":"35.24.7.09"}]
[null,"SP","Jales","SP - Jales",{"v":3524808,"d":"35.24.8.08"}]
[null,"SP","Jambeiro","SP - Jambeiro",{"v":3524907,"d":"35.24.9.07"}]
[null,"SP","Jandira","SP - Jandira",{"v":3525003,"d":"35.25.0.03"}]
[null,"SP","Jardinópolis","SP - Jardinópolis",{"v":3525102,"d":"35.25.1.02"}]
[null,"SP","Jarinu","SP - Jarinu",{"v":3525201,"d":"35.25.2.01"}]
[null,"SP","Jaú","SP - Jaú",{"v":3525300,"d":"35.25.3.00"}]
[null,"SP","Jeriquara","SP - Jeriquara",{"v":3525409,"d":"35.25.4.09"}]
[null,"SP","Joanópolis","SP - Joanópolis",{"v":3525508,"d":"35.25.5.08"}]
[null,"SP","João Ramalho","SP - João Ramalho",{"v":3525607,"d":"35.25.6.07"}]
[null,"SP","José Bonifácio","SP - José Bonifácio",{"v":3525706,"d":"35.25.7.06"}]
[null,"SP","Júlio Mesquita","SP - Júlio Mesquita",{"v":3525805,"d":"35.25.8.05"}]
[null,"SP","Jumirim","SP - Jumirim",{"v":3525854,"d":"35.25.8.54"}]
[null,"SP","Jundiaí","SP - Jundiaí",{"v":3525904,"d":"35.25.9.04"}]
[null,"SP","Junqueirópolis","SP - Junqueirópolis",{"v":3526001,"d":"35.26.0.01"}]
[null,"SP","Juquiá","SP - Juquiá",{"v":3526100,"d":"35.26.1.00"}]
[null,"SP","Juquitiba","SP - Juquitiba",{"v":3526209,"d":"35.26.2.09"}]
[null,"SP","Lagoinha","SP - Lagoinha",{"v":3526308,"d":"35.26.3.08"}]
[null,"SP","Laranjal Paulista","SP - Laranjal Paulista",{"v":3526407,"d":"35.26.4.07"}]
[null,"SP","Lavínia","SP - Lavínia",{"v":3526506,"d":"35.26.5.06"}]
[null,"SP","Lavrinhas","SP - Lavrinhas",{"v":3526605,"d":"35.26.6.05"}]
[null,"SP","Leme","SP - Leme",{"v":3526704,"d":"35.26.7.04"}]
[null,"SP","Lençóis Paulista","SP - Lençóis Paulista",{"v":3526803,"d":"35.26.8.03"}]
[null,"SP","Limeira","SP - Limeira",{"v":3526902,"d":"35.26.9.02"}]
[null,"SP","Lindóia","SP - Lindóia",{"v":3527009,"d":"35.27.0.09"}]
[null,"SP","Lins","SP - Lins",{"v":3527108,"d":"35.27.1.08"}]
[null,"SP","Lorena","SP - Lorena",{"v":3527207,"d":"35.27.2.07"}]
[null,"SP","Lourdes","SP - Lourdes",{"v":3527256,"d":"35.27.2.56"}]
[null,"SP","Louveira","SP - Louveira",{"v":3527306,"d":"35.27.3.06"}]
[null,"SP","Lucélia","SP - Lucélia",{"v":3527405,"d":"35.27.4.05"}]
[null,"SP","Lucianópolis","SP - Lucianópolis",{"v":3527504,"d":"35.27.5.04"}]
[null,"SP","Luís Antônio","SP - Luís Antônio",{"v":3527603,"d":"35.27.6.03"}]
[null,"SP","Luiziânia","SP - Luiziânia",{"v":3527702,"d":"35.27.7.02"}]
[null,"SP","Lupércio","SP - Lupércio",{"v":3527801,"d":"35.27.8.01"}]
[null,"SP","Lutécia","SP - Lutécia",{"v":3527900,"d":"35.27.9.00"}]
[null,"SP","Macatuba","SP - Macatuba",{"v":3528007,"d":"35.28.0.07"}]
[null,"SP","Macaubal","SP - Macaubal",{"v":3528106,"d":"35.28.1.06"}]
[null,"SP","Macedônia","SP - Macedônia",{"v":3528205,"d":"35.28.2.05"}]
[null,"SP","Magda","SP - Magda",{"v":3528304,"d":"35.28.3.04"}]
[null,"SP","Mairinque","SP - Mairinque",{"v":3528403,"d":"35.28.4.03"}]
[null,"SP","Mairiporã","SP - Mairiporã",{"v":3528502,"d":"35.28.5.02"}]
[null,"SP","Manduri","SP - Manduri",{"v":3528601,"d":"35.28.6.01"}]
[null,"SP","Marabá Paulista","SP - Marabá Paulista",{"v":3528700,"d":"35.28.7.00"}]
[null,"SP","Maracaí","SP - Maracaí",{"v":3528809,"d":"35.28.8.09"}]
[null,"SP","Marapoama","SP - Marapoama",{"v":3528858,"d":"35.28.8.58"}]
[null,"SP","Mariápolis","SP - Mariápolis",{"v":3528908,"d":"35.28.9.08"}]
[null,"SP","Marília","SP - Marília",{"v":3529005,"d":"35.29.0.05"}]
[null,"SP","Marinópolis","SP - Marinópolis",{"v":3529104,"d":"35.29.1.04"}]
[null,"SP","Martinópolis","SP - Martinópolis",{"v":3529203,"d":"35.29.2.03"}]
[null,"SP","Matão","SP - Matão",{"v":3529302,"d":"35.29.3.02"}]
[null,"SP","Mauá","SP - Mauá",{"v":3529401,"d":"35.29.4.01"}]
[null,"SP","Mendonça","SP - Mendonça",{"v":3529500,"d":"35.29.5.00"}]
[null,"SP","Meridiano","SP - Meridiano",{"v":3529609,"d":"35.29.6.09"}]
[null,"SP","Mesópolis",{"$f":"CONCATENATE(B5151,\" - \",C5151)","v":"SP - Mesópolis"},{"v":3529658,"d":"35.29.6.58"}]
[null,"SP","Miguelópolis","SP - Miguelópolis",{"v":3529708,"d":"35.29.7.08"}]
[null,"SP","Mineiros do Tietê","SP - Mineiros do Tietê",{"v":3529807,"d":"35.29.8.07"}]
[null,"SP","Mira Estrela","SP - Mira Estrela",{"v":3530003,"d":"35.30.0.03"}]
[null,"SP","Miracatu","SP - Miracatu",{"v":3529906,"d":"35.29.9.06"}]
[null,"SP","Mirandópolis","SP - Mirandópolis",{"v":3530102,"d":"35.30.1.02"}]
[null,"SP","Mirante do Paranapanema","SP - Mirante do Paranapanema",{"v":3530201,"d":"35.30.2.01"}]
[null,"SP","Mirassol","SP - Mirassol",{"v":3530300,"d":"35.30.3.00"}]
[null,"SP","Mirassolândia","SP - Mirassolândia",{"v":3530409,"d":"35.30.4.09"}]
[null,"SP","Mococa","SP - Mococa",{"v":3530508,"d":"35.30.5.08"}]
[null,"SP","Mogi das Cruzes","SP - Mogi das Cruzes",{"v":3530607,"d":"35.30.6.07"}]
[null,"SP","Mogi Guaçu","SP - Mogi Guaçu",{"v":3530706,"d":"35.30.7.06"}]
[null,"SP","Moji Mirim","SP - Moji Mirim",{"v":3530805,"d":"35.30.8.05"}]
[null,"SP","Mombuca","SP - Mombuca",{"v":3530904,"d":"35.30.9.04"}]
[null,"SP","Monções","SP - Monções",{"v":3531001,"d":"35.31.0.01"}]
[null,"SP","Mongaguá","SP - Mongaguá",{"v":3531100,"d":"35.31.1.00"}]
[null,"SP","Monte Alegre do Sul","SP - Monte Alegre do Sul",{"v":3531209,"d":"35.31.2.09"}]
[null,"SP","Monte Alto","SP - Monte Alto",{"v":3531308,"d":"35.31.3.08"}]
[null,"SP","Monte Aprazível","SP - Monte Aprazível",{"v":3531407,"d":"35.31.4.07"}]
[null,"SP","Monte Azul Paulista","SP - Monte Azul Paulista",{"v":3531506,"d":"35.31.5.06"}]
[null,"SP","Monte Castelo","SP - Monte Castelo",{"v":3531605,"d":"35.31.6.05"}]
[null,"SP","Monte Mor","SP - Monte Mor",{"v":3531803,"d":"35.31.8.03"}]
[null,"SP","Monteiro Lobato","SP - Monteiro Lobato",{"v":3531704,"d":"35.31.7.04"}]
[null,"SP","Morro Agudo","SP - Morro Agudo",{"v":3531902,"d":"35.31.9.02"}]
[null,"SP","Morungaba","SP - Morungaba",{"v":3532009,"d":"35.32.0.09"}]
[null,"SP","Motuca","SP - Motuca",{"v":3532058,"d":"35.32.0.58"}]
[null,"SP","Murutinga do Sul","SP - Murutinga do Sul",{"v":3532108,"d":"35.32.1.08"}]
[null,"SP","Nantes","SP - Nantes",{"v":3532157,"d":"35.32.1.57"}]
[null,"SP","Narandiba","SP - Narandiba",{"v":3532207,"d":"35.32.2.07"}]
[null,"SP","Natividade da Serra","SP - Natividade da Serra",{"v":3532306,"d":"35.32.3.06"}]
[null,"SP","Nazaré Paulista","SP - Nazaré Paulista",{"v":3532405,"d":"35.32.4.05"}]
[null,"SP","Neves Paulista","SP - Neves Paulista",{"v":3532504,"d":"35.32.5.04"}]
[null,"SP","Nhandeara","SP - Nhandeara",{"v":3532603,"d":"35.32.6.03"}]
[null,"SP","Nipoã","SP - Nipoã",{"v":3532702,"d":"35.32.7.02"}]
[null,"SP","Nova Aliança","SP - Nova Aliança",{"v":3532801,"d":"35.32.8.01"}]
[null,"SP","Nova Campina","SP - Nova Campina",{"v":3532827,"d":"35.32.8.27"}]
[null,"SP","Nova Canaã Paulista","SP - Nova Canaã Paulista",{"v":3532843,"d":"35.32.8.43"}]
[null,"SP","Nova Castilho","SP - Nova Castilho",{"v":3532868,"d":"35.32.8.68"}]
[null,"SP","Nova Europa","SP - Nova Europa",{"v":3532900,"d":"35.32.9.00"}]
[null,"SP","Nova Granada","SP - Nova Granada",{"v":3533007,"d":"35.33.0.07"}]
[null,"SP","Nova Guataporanga","SP - Nova Guataporanga",{"v":3533106,"d":"35.33.1.06"}]
[null,"SP","Nova Independência","SP - Nova Independência",{"v":3533205,"d":"35.33.2.05"}]
[null,"SP","Nova Luzitânia","SP - Nova Luzitânia",{"v":3533304,"d":"35.33.3.04"}]
[null,"SP","Nova Odessa","SP - Nova Odessa",{"v":3533403,"d":"35.33.4.03"}]
[null,"SP","Novais","SP - Novais",{"v":3533254,"d":"35.33.2.54"}]
[null,"SP","Novo Horizonte","SP - Novo Horizonte",{"v":3533502,"d":"35.33.5.02"}]
[null,"SP","Nuporanga","SP - Nuporanga",{"v":3533601,"d":"35.33.6.01"}]
[null,"SP","Ocauçu","SP - Ocauçu",{"v":3533700,"d":"35.33.7.00"}]
[null,"SP","Óleo","SP - Óleo",{"v":3533809,"d":"35.33.8.09"}]
[null,"SP","Olímpia","SP - Olímpia",{"v":3533908,"d":"35.33.9.08"}]
[null,"SP","Onda Verde","SP - Onda Verde",{"v":3534005,"d":"35.34.0.05"}]
[null,"SP","Oriente","SP - Oriente",{"v":3534104,"d":"35.34.1.04"}]
[null,"SP","Orindiúva","SP - Orindiúva",{"v":3534203,"d":"35.34.2.03"}]
[null,"SP","Orlândia","SP - Orlândia",{"v":3534302,"d":"35.34.3.02"}]
[null,"SP","Osasco","SP - Osasco",{"v":3534401,"d":"35.34.4.01"}]
[null,"SP","Oscar Bressane","SP - Oscar Bressane",{"v":3534500,"d":"35.34.5.00"}]
[null,"SP","Osvaldo Cruz","SP - Osvaldo Cruz",{"v":3534609,"d":"35.34.6.09"}]
[null,"SP","Ourinhos","SP - Ourinhos",{"v":3534708,"d":"35.34.7.08"}]
[null,"SP","Ouro Verde","SP - Ouro Verde",{"v":3534807,"d":"35.34.8.07"}]
[null,"SP","Ouroeste","SP - Ouroeste",{"v":3534757,"d":"35.34.7.57"}]
[null,"SP","Pacaembu","SP - Pacaembu",{"v":3534906,"d":"35.34.9.06"}]
[null,"SP","Palestina","SP - Palestina",{"v":3535002,"d":"35.35.0.02"}]
[null,"SP","Palmares Paulista","SP - Palmares Paulista",{"v":3535101,"d":"35.35.1.01"}]
[null,"SP","Palmeira d'Oeste","SP - Palmeira d'Oeste",{"v":3535200,"d":"35.35.2.00"}]
[null,"SP","Palmital",{"$f":"CONCATENATE(B5215,\" - \",C5215)","v":"SP - Palmital"},{"v":3535309,"d":"35.35.3.09"}]
[null,"SP","Panorama","SP - Panorama",{"v":3535408,"d":"35.35.4.08"}]
[null,"SP","Paraguaçu Paulista","SP - Paraguaçu Paulista",{"v":3535507,"d":"35.35.5.07"}]
[null,"SP","Paraibuna","SP - Paraibuna",{"v":3535606,"d":"35.35.6.06"}]
[null,"SP","Paraíso","SP - Paraíso",{"v":3535705,"d":"35.35.7.05"}]
[null,"SP","Paranapanema","SP - Paranapanema",{"v":3535804,"d":"35.35.8.04"}]
[null,"SP","Paranapuã","SP - Paranapuã",{"v":3535903,"d":"35.35.9.03"}]
[null,"SP","Parapuã","SP - Parapuã",{"v":3536000,"d":"35.36.0.00"}]
[null,"SP","Pardinho","SP - Pardinho",{"v":3536109,"d":"35.36.1.09"}]
[null,"SP","Pariquera-Açu","SP - Pariquera-Açu",{"v":3536208,"d":"35.36.2.08"}]
[null,"SP","Parisi","SP - Parisi",{"v":3536257,"d":"35.36.2.57"}]
[null,"SP","Patrocínio Paulista","SP - Patrocínio Paulista",{"v":3536307,"d":"35.36.3.07"}]
[null,"SP","Paulicéia","SP - Paulicéia",{"v":3536406,"d":"35.36.4.06"}]
[null,"SP","Paulínia","SP - Paulínia",{"v":3536505,"d":"35.36.5.05"}]
[null,"SP","Paulistânia","SP - Paulistânia",{"v":3536570,"d":"35.36.5.70"}]
[null,"SP","Paulo de Faria","SP - Paulo de Faria",{"v":3536604,"d":"35.36.6.04"}]
[null,"SP","Pederneiras","SP - Pederneiras",{"v":3536703,"d":"35.36.7.03"}]
[null,"SP","Pedra Bela","SP - Pedra Bela",{"v":3536802,"d":"35.36.8.02"}]
[null,"SP","Pedranópolis","SP - Pedranópolis",{"v":3536901,"d":"35.36.9.01"}]
[null,"SP","Pedregulho","SP - Pedregulho",{"v":3537008,"d":"35.37.0.08"}]
[null,"SP","Pedreira","SP - Pedreira",{"v":3537107,"d":"35.37.1.07"}]
[null,"SP","Pedrinhas Paulista","SP - Pedrinhas Paulista",{"v":3537156,"d":"35.37.1.56"}]
[null,"SP","Pedro de Toledo","SP - Pedro de Toledo",{"v":3537206,"d":"35.37.2.06"}]
[null,"SP","Penápolis","SP - Penápolis",{"v":3537305,"d":"35.37.3.05"}]
[null,"SP","Pereira Barreto","SP - Pereira Barreto",{"v":3537404,"d":"35.37.4.04"}]
[null,"SP","Pereiras","SP - Pereiras",{"v":3537503,"d":"35.37.5.03"}]
[null,"SP","Peruíbe","SP - Peruíbe",{"v":3537602,"d":"35.37.6.02"}]
[null,"SP","Piacatu","SP - Piacatu",{"v":3537701,"d":"35.37.7.01"}]
[null,"SP","Piedade","SP - Piedade",{"v":3537800,"d":"35.37.8.00"}]
[null,"SP","Pilar do Sul","SP - Pilar do Sul",{"v":3537909,"d":"35.37.9.09"}]
[null,"SP","Pindamonhangaba","SP - Pindamonhangaba",{"v":3538006,"d":"35.38.0.06"}]
[null,"SP","Pindorama","SP - Pindorama",{"v":3538105,"d":"35.38.1.05"}]
[null,"SP","Pinhalzinho","SP - Pinhalzinho",{"v":3538204,"d":"35.38.2.04"}]
[null,"SP","Piquerobi","SP - Piquerobi",{"v":3538303,"d":"35.38.3.03"}]
[null,"SP","Piquete","SP - Piquete",{"v":3538501,"d":"35.38.5.01"}]
[null,"SP","Piracaia","SP - Piracaia",{"v":3538600,"d":"35.38.6.00"}]
[null,"SP","Piracicaba","SP - Piracicaba",{"v":3538709,"d":"35.38.7.09"}]
[null,"SP","Piraju","SP - Piraju",{"v":3538808,"d":"35.38.8.08"}]
[null,"SP","Pirajuí","SP - Pirajuí",{"v":3538907,"d":"35.38.9.07"}]
[null,"SP","Pirangi","SP - Pirangi",{"v":3539004,"d":"35.39.0.04"}]
[null,"SP","Pirapora do Bom Jesus","SP - Pirapora do Bom Jesus",{"v":3539103,"d":"35.39.1.03"}]
[null,"SP","Pirapozinho","SP - Pirapozinho",{"v":3539202,"d":"35.39.2.02"}]
[null,"SP","Pirassununga","SP - Pirassununga",{"v":3539301,"d":"35.39.3.01"}]
[null,"SP","Piratininga","SP - Piratininga",{"v":3539400,"d":"35.39.4.00"}]
[null,"SP","Pitangueiras","SP - Pitangueiras",{"v":3539509,"d":"35.39.5.09"}]
[null,"SP","Planalto","SP - Planalto",{"v":3539608,"d":"35.39.6.08"}]
[null,"SP","Platina","SP - Platina",{"v":3539707,"d":"35.39.7.07"}]
[null,"SP","Poá","SP - Poá",{"v":3539806,"d":"35.39.8.06"}]
[null,"SP","Poloni","SP - Poloni",{"v":3539905,"d":"35.39.9.05"}]
[null,"SP","Pompéia","SP - Pompéia",{"v":3540002,"d":"35.40.0.02"}]
[null,"SP","Pongaí","SP - Pongaí",{"v":3540101,"d":"35.40.1.01"}]
[null,"SP","Pontal","SP - Pontal",{"v":3540200,"d":"35.40.2.00"}]
[null,"SP","Pontalinda","SP - Pontalinda",{"v":3540259,"d":"35.40.2.59"}]
[null,"SP","Pontes Gestal","SP - Pontes Gestal",{"v":3540309,"d":"35.40.3.09"}]
[null,"SP","Populina","SP - Populina",{"v":3540408,"d":"35.40.4.08"}]
[null,"SP","Porangaba","SP - Porangaba",{"v":3540507,"d":"35.40.5.07"}]
[null,"SP","Porto Feliz","SP - Porto Feliz",{"v":3540606,"d":"35.40.6.06"}]
[null,"SP","Porto Ferreira","SP - Porto Ferreira",{"v":3540705,"d":"35.40.7.05"}]
[null,"SP","Potim","SP - Potim",{"v":3540754,"d":"35.40.7.54"}]
[null,"SP","Potirendaba","SP - Potirendaba",{"v":3540804,"d":"35.40.8.04"}]
[null,"SP","Pracinha","SP - Pracinha",{"v":3540853,"d":"35.40.8.53"}]
[null,"SP","Pradópolis","SP - Pradópolis",{"v":3540903,"d":"35.40.9.03"}]
[null,"SP","Praia Grande","SP - Praia Grande",{"v":3541000,"d":"35.41.0.00"}]
[null,"SP","Pratânia","SP - Pratânia",{"v":3541059,"d":"35.41.0.59"}]
[null,"SP","Presidente Alves",{"$f":"CONCATENATE(B5279,\" - \",C5279)","v":"SP - Presidente Alves"},{"v":3541109,"d":"35.41.1.09"}]
[null,"SP","Presidente Bernardes","SP - Presidente Bernardes",{"v":3541208,"d":"35.41.2.08"}]
[null,"SP","Presidente Epitácio","SP - Presidente Epitácio",{"v":3541307,"d":"35.41.3.07"}]
[null,"SP","Presidente Prudente","SP - Presidente Prudente",{"v":3541406,"d":"35.41.4.06"}]
[null,"SP","Presidente Venceslau","SP - Presidente Venceslau",{"v":3541505,"d":"35.41.5.05"}]
[null,"SP","Promissão","SP - Promissão",{"v":3541604,"d":"35.41.6.04"}]
[null,"SP","Quadra","SP - Quadra",{"v":3541653,"d":"35.41.6.53"}]
[null,"SP","Quatá","SP - Quatá",{"v":3541703,"d":"35.41.7.03"}]
[null,"SP","Queiroz","SP - Queiroz",{"v":3541802,"d":"35.41.8.02"}]
[null,"SP","Queluz","SP - Queluz",{"v":3541901,"d":"35.41.9.01"}]
[null,"SP","Quintana","SP - Quintana",{"v":3542008,"d":"35.42.0.08"}]
[null,"SP","Rafard","SP - Rafard",{"v":3542107,"d":"35.42.1.07"}]
[null,"SP","Rancharia","SP - Rancharia",{"v":3542206,"d":"35.42.2.06"}]
[null,"SP","Redenção da Serra","SP - Redenção da Serra",{"v":3542305,"d":"35.42.3.05"}]
[null,"SP","Regente Feijó","SP - Regente Feijó",{"v":3542404,"d":"35.42.4.04"}]
[null,"SP","Reginópolis","SP - Reginópolis",{"v":3542503,"d":"35.42.5.03"}]
[null,"SP","Registro","SP - Registro",{"v":3542602,"d":"35.42.6.02"}]
[null,"SP","Restinga","SP - Restinga",{"v":3542701,"d":"35.42.7.01"}]
[null,"SP","Ribeira","SP - Ribeira",{"v":3542800,"d":"35.42.8.00"}]
[null,"SP","Ribeirão Bonito","SP - Ribeirão Bonito",{"v":3542909,"d":"35.42.9.09"}]
[null,"SP","Ribeirão Branco","SP - Ribeirão Branco",{"v":3543006,"d":"35.43.0.06"}]
[null,"SP","Ribeirão Corrente","SP - Ribeirão Corrente",{"v":3543105,"d":"35.43.1.05"}]
[null,"SP","Ribeirão do Sul","SP - Ribeirão do Sul",{"v":3543204,"d":"35.43.2.04"}]
[null,"SP","Ribeirão dos Índios","SP - Ribeirão dos Índios",{"v":3543238,"d":"35.43.2.38"}]
[null,"SP","Ribeirão Grande","SP - Ribeirão Grande",{"v":3543253,"d":"35.43.2.53"}]
[null,"SP","Ribeirão Pires","SP - Ribeirão Pires",{"v":3543303,"d":"35.43.3.03"}]
[null,"SP","Ribeirão Preto","SP - Ribeirão Preto",{"v":3543402,"d":"35.43.4.02"}]
[null,"SP","Rifaina","SP - Rifaina",{"v":3543600,"d":"35.43.6.00"}]
[null,"SP","Rincão","SP - Rincão",{"v":3543709,"d":"35.43.7.09"}]
[null,"SP","Rinópolis","SP - Rinópolis",{"v":3543808,"d":"35.43.8.08"}]
[null,"SP","Rio Claro","SP - Rio Claro",{"v":3543907,"d":"35.43.9.07"}]
[null,"SP","Rio das Pedras","SP - Rio das Pedras",{"v":3544004,"d":"35.44.0.04"}]
[null,"SP","Rio Grande da Serra","SP - Rio Grande da Serra",{"v":3544103,"d":"35.44.1.03"}]
[null,"SP","Riolândia","SP - Riolândia",{"v":3544202,"d":"35.44.2.02"}]
[null,"SP","Riversul","SP - Riversul",{"v":3543501,"d":"35.43.5.01"}]
[null,"SP","Rosana","SP - Rosana",{"v":3544251,"d":"35.44.2.51"}]
[null,"SP","Roseira","SP - Roseira",{"v":3544301,"d":"35.44.3.01"}]
[null,"SP","Rubiácea","SP - Rubiácea",{"v":3544400,"d":"35.44.4.00"}]
[null,"SP","Rubinéia","SP - Rubinéia",{"v":3544509,"d":"35.44.5.09"}]
[null,"SP","Sabino","SP - Sabino",{"v":3544608,"d":"35.44.6.08"}]
[null,"SP","Sagres","SP - Sagres",{"v":3544707,"d":"35.44.7.07"}]
[null,"SP","Sales","SP - Sales",{"v":3544806,"d":"35.44.8.06"}]
[null,"SP","Sales Oliveira","SP - Sales Oliveira",{"v":3544905,"d":"35.44.9.05"}]
[null,"SP","Salesópolis","SP - Salesópolis",{"v":3545001,"d":"35.45.0.01"}]
[null,"SP","Salmourão","SP - Salmourão",{"v":3545100,"d":"35.45.1.00"}]
[null,"SP","Saltinho","SP - Saltinho",{"v":3545159,"d":"35.45.1.59"}]
[null,"SP","Salto","SP - Salto",{"v":3545209,"d":"35.45.2.09"}]
[null,"SP","Salto de Pirapora","SP - Salto de Pirapora",{"v":3545308,"d":"35.45.3.08"}]
[null,"SP","Salto Grande","SP - Salto Grande",{"v":3545407,"d":"35.45.4.07"}]
[null,"SP","Sandovalina","SP - Sandovalina",{"v":3545506,"d":"35.45.5.06"}]
[null,"SP","Santa Adélia","SP - Santa Adélia",{"v":3545605,"d":"35.45.6.05"}]
[null,"SP","Santa Albertina","SP - Santa Albertina",{"v":3545704,"d":"35.45.7.04"}]
[null,"SP","Santa Bárbara d'Oeste","SP - Santa Bárbara d'Oeste",{"v":3545803,"d":"35.45.8.03"}]
[null,"SP","Santa Branca","SP - Santa Branca",{"v":3546009,"d":"35.46.0.09"}]
[null,"SP","Santa Clara d'Oeste","SP - Santa Clara d'Oeste",{"v":3546108,"d":"35.46.1.08"}]
[null,"SP","Santa Cruz da Conceição","SP - Santa Cruz da Conceição",{"v":3546207,"d":"35.46.2.07"}]
[null,"SP","Santa Cruz da Esperança","SP - Santa Cruz da Esperança",{"v":3546256,"d":"35.46.2.56"}]
[null,"SP","Santa Cruz das Palmeiras","SP - Santa Cruz das Palmeiras",{"v":3546306,"d":"35.46.3.06"}]
[null,"SP","Santa Cruz do Rio Pardo","SP - Santa Cruz do Rio Pardo",{"v":3546405,"d":"35.46.4.05"}]
[null,"SP","Santa Ernestina","SP - Santa Ernestina",{"v":3546504,"d":"35.46.5.04"}]
[null,"SP","Santa Fé do Sul","SP - Santa Fé do Sul",{"v":3546603,"d":"35.46.6.03"}]
[null,"SP","Santa Gertrudes","SP - Santa Gertrudes",{"v":3546702,"d":"35.46.7.02"}]
[null,"SP","Santa Isabel","SP - Santa Isabel",{"v":3546801,"d":"35.46.8.01"}]
[null,"SP","Santa Lúcia","SP - Santa Lúcia",{"v":3546900,"d":"35.46.9.00"}]
[null,"SP","Santa Maria da Serra",{"$f":"CONCATENATE(B5343,\" - \",C5343)","v":"SP - Santa Maria da Serra"},{"v":3547007,"d":"35.47.0.07"}]
[null,"SP","Santa Mercedes","SP - Santa Mercedes",{"v":3547106,"d":"35.47.1.06"}]
[null,"SP","Santa Rita do Passa Quatro","SP - Santa Rita do Passa Quatro",{"v":3547502,"d":"35.47.5.02"}]
[null,"SP","Santa Rita d'Oeste","SP - Santa Rita d'Oeste",{"v":3547403,"d":"35.47.4.03"}]
[null,"SP","Santa Rosa de Viterbo","SP - Santa Rosa de Viterbo",{"v":3547601,"d":"35.47.6.01"}]
[null,"SP","Santa Salete","SP - Santa Salete",{"v":3547650,"d":"35.47.6.50"}]
[null,"SP","Santana da Ponte Pensa","SP - Santana da Ponte Pensa",{"v":3547205,"d":"35.47.2.05"}]
[null,"SP","Santana de Parnaíba","SP - Santana de Parnaíba",{"v":3547304,"d":"35.47.3.04"}]
[null,"SP","Santo Anastácio","SP - Santo Anastácio",{"v":3547700,"d":"35.47.7.00"}]
[null,"SP","Santo André","SP - Santo André",{"v":3547809,"d":"35.47.8.09"}]
[null,"SP","Santo Antônio da Alegria","SP - Santo Antônio da Alegria",{"v":3547908,"d":"35.47.9.08"}]
[null,"SP","Santo Antônio de Posse","SP - Santo Antônio de Posse",{"v":3548005,"d":"35.48.0.05"}]
[null,"SP","Santo Antônio do Aracanguá","SP - Santo Antônio do Aracanguá",{"v":3548054,"d":"35.48.0.54"}]
[null,"SP","Santo Antônio do Jardim","SP - Santo Antônio do Jardim",{"v":3548104,"d":"35.48.1.04"}]
[null,"SP","Santo Antônio do Pinhal","SP - Santo Antônio do Pinhal",{"v":3548203,"d":"35.48.2.03"}]
[null,"SP","Santo Expedito","SP - Santo Expedito",{"v":3548302,"d":"35.48.3.02"}]
[null,"SP","Santópolis do Aguapeí","SP - Santópolis do Aguapeí",{"v":3548401,"d":"35.48.4.01"}]
[null,"SP","Santos","SP - Santos",{"v":3548500,"d":"35.48.5.00"}]
[null,"SP","São Bento do Sapucaí","SP - São Bento do Sapucaí",{"v":3548609,"d":"35.48.6.09"}]
[null,"SP","São Bernardo do Campo","SP - São Bernardo do Campo",{"v":3548708,"d":"35.48.7.08"}]
[null,"SP","São Caetano do Sul","SP - São Caetano do Sul",{"v":3548807,"d":"35.48.8.07"}]
[null,"SP","São Carlos","SP - São Carlos",{"v":3548906,"d":"35.48.9.06"}]
[null,"SP","São Francisco","SP - São Francisco",{"v":3549003,"d":"35.49.0.03"}]
[null,"SP","São João da Boa Vista","SP - São João da Boa Vista",{"v":3549102,"d":"35.49.1.02"}]
[null,"SP","São João das Duas Pontes","SP - São João das Duas Pontes",{"v":3549201,"d":"35.49.2.01"}]
[null,"SP","São João de Iracema","SP - São João de Iracema",{"v":3549250,"d":"35.49.2.50"}]
[null,"SP","São João do Pau d'Alho","SP - São João do Pau d'Alho",{"v":3549300,"d":"35.49.3.00"}]
[null,"SP","São Joaquim da Barra","SP - São Joaquim da Barra",{"v":3549409,"d":"35.49.4.09"}]
[null,"SP","São José da Bela Vista","SP - São José da Bela Vista",{"v":3549508,"d":"35.49.5.08"}]
[null,"SP","São José do Barreiro","SP - São José do Barreiro",{"v":3549607,"d":"35.49.6.07"}]
[null,"SP","São José do Rio Pardo","SP - São José do Rio Pardo",{"v":3549706,"d":"35.49.7.06"}]
[null,"SP","São José do Rio Preto","SP - São José do Rio Preto",{"v":3549805,"d":"35.49.8.05"}]
[null,"SP","São José dos Campos","SP - São José dos Campos",{"v":3549904,"d":"35.49.9.04"}]
[null,"SP","São Lourenço da Serra","SP - São Lourenço da Serra",{"v":3549953,"d":"35.49.9.53"}]
[null,"SP","São Luís do Paraitinga","SP - São Luís do Paraitinga",{"v":3550001,"d":"35.50.0.01"}]
[null,"SP","São Manuel","SP - São Manuel",{"v":3550100,"d":"35.50.1.00"}]
[null,"SP","São Miguel Arcanjo","SP - São Miguel Arcanjo",{"v":3550209,"d":"35.50.2.09"}]
[null,"SP","São Paulo","SP - São Paulo",{"v":3550308,"d":"35.50.3.08"}]
[null,"SP","São Pedro","SP - São Pedro",{"v":3550407,"d":"35.50.4.07"}]
[null,"SP","São Pedro do Turvo","SP - São Pedro do Turvo",{"v":3550506,"d":"35.50.5.06"}]
[null,"SP","São Roque","SP - São Roque",{"v":3550605,"d":"35.50.6.05"}]
[null,"SP","São Sebastião","SP - São Sebastião",{"v":3550704,"d":"35.50.7.04"}]
[null,"SP","São Sebastião da Grama","SP - São Sebastião da Grama",{"v":3550803,"d":"35.50.8.03"}]
[null,"SP","São Simão","SP - São Simão",{"v":3550902,"d":"35.50.9.02"}]
[null,"SP","São Vicente","SP - São Vicente",{"v":3551009,"d":"35.51.0.09"}]
[null,"SP","Sarapuí","SP - Sarapuí",{"v":3551108,"d":"35.51.1.08"}]
[null,"SP","Sarutaiá","SP - Sarutaiá",{"v":3551207,"d":"35.51.2.07"}]
[null,"SP","Sebastianópolis do Sul","SP - Sebastianópolis do Sul",{"v":3551306,"d":"35.51.3.06"}]
[null,"SP","Serra Azul","SP - Serra Azul",{"v":3551405,"d":"35.51.4.05"}]
[null,"SP","Serra Negra","SP - Serra Negra",{"v":3551603,"d":"35.51.6.03"}]
[null,"SP","Serrana","SP - Serrana",{"v":3551504,"d":"35.51.5.04"}]
[null,"SP","Sertãozinho","SP - Sertãozinho",{"v":3551702,"d":"35.51.7.02"}]
[null,"SP","Sete Barras","SP - Sete Barras",{"v":3551801,"d":"35.51.8.01"}]
[null,"SP","Severínia","SP - Severínia",{"v":3551900,"d":"35.51.9.00"}]
[null,"SP","Silveiras","SP - Silveiras",{"v":3552007,"d":"35.52.0.07"}]
[null,"SP","Socorro","SP - Socorro",{"v":3552106,"d":"35.52.1.06"}]
[null,"SP","Sorocaba","SP - Sorocaba",{"v":3552205,"d":"35.52.2.05"}]
[null,"SP","Sud Mennucci","SP - Sud Mennucci",{"v":3552304,"d":"35.52.3.04"}]
[null,"SP","Sumaré","SP - Sumaré",{"v":3552403,"d":"35.52.4.03"}]
[null,"SP","Suzanápolis","SP - Suzanápolis",{"v":3552551,"d":"35.52.5.51"}]
[null,"SP","Suzano","SP - Suzano",{"v":3552502,"d":"35.52.5.02"}]
[null,"SP","Tabapuã","SP - Tabapuã",{"v":3552601,"d":"35.52.6.01"}]
[null,"SP","Tabatinga","SP - Tabatinga",{"v":3552700,"d":"35.52.7.00"}]
[null,"SP","Taboão da Serra","SP - Taboão da Serra",{"v":3552809,"d":"35.52.8.09"}]
[null,"SP","Taciba",{"$f":"CONCATENATE(B5407,\" - \",C5407)","v":"SP - Taciba"},{"v":3552908,"d":"35.52.9.08"}]
[null,"SP","Taguaí","SP - Taguaí",{"v":3553005,"d":"35.53.0.05"}]
[null,"SP","Taiaçu","SP - Taiaçu",{"v":3553104,"d":"35.53.1.04"}]
[null,"SP","Taiúva","SP - Taiúva",{"v":3553203,"d":"35.53.2.03"}]
[null,"SP","Tambaú","SP - Tambaú",{"v":3553302,"d":"35.53.3.02"}]
[null,"SP","Tanabi","SP - Tanabi",{"v":3553401,"d":"35.53.4.01"}]
[null,"SP","Tapiraí","SP - Tapiraí",{"v":3553500,"d":"35.53.5.00"}]
[null,"SP","Tapiratiba","SP - Tapiratiba",{"v":3553609,"d":"35.53.6.09"}]
[null,"SP","Taquaral","SP - Taquaral",{"v":3553658,"d":"35.53.6.58"}]
[null,"SP","Taquaritinga","SP - Taquaritinga",{"v":3553708,"d":"35.53.7.08"}]
[null,"SP","Taquarituba","SP - Taquarituba",{"v":3553807,"d":"35.53.8.07"}]
[null,"SP","Taquarivaí","SP - Taquarivaí",{"v":3553856,"d":"35.53.8.56"}]
[null,"SP","Tarabai","SP - Tarabai",{"v":3553906,"d":"35.53.9.06"}]
[null,"SP","Tarumã","SP - Tarumã",{"v":3553955,"d":"35.53.9.55"}]
[null,"SP","Tatuí","SP - Tatuí",{"v":3554003,"d":"35.54.0.03"}]
[null,"SP","Taubaté","SP - Taubaté",{"v":3554102,"d":"35.54.1.02"}]
[null,"SP","Tejupá","SP - Tejupá",{"v":3554201,"d":"35.54.2.01"}]
[null,"SP","Teodoro Sampaio","SP - Teodoro Sampaio",{"v":3554300,"d":"35.54.3.00"}]
[null,"SP","Terra Roxa","SP - Terra Roxa",{"v":3554409,"d":"35.54.4.09"}]
[null,"SP","Tietê","SP - Tietê",{"v":3554508,"d":"35.54.5.08"}]
[null,"SP","Timburi","SP - Timburi",{"v":3554607,"d":"35.54.6.07"}]
[null,"SP","Torre de Pedra","SP - Torre de Pedra",{"v":3554656,"d":"35.54.6.56"}]
[null,"SP","Torrinha","SP - Torrinha",{"v":3554706,"d":"35.54.7.06"}]
[null,"SP","Trabiju","SP - Trabiju",{"v":3554755,"d":"35.54.7.55"}]
[null,"SP","Tremembé","SP - Tremembé",{"v":3554805,"d":"35.54.8.05"}]
[null,"SP","Três Fronteiras","SP - Três Fronteiras",{"v":3554904,"d":"35.54.9.04"}]
[null,"SP","Tuiuti","SP - Tuiuti",{"v":3554953,"d":"35.54.9.53"}]
[null,"SP","Tupã","SP - Tupã",{"v":3555000,"d":"35.55.0.00"}]
[null,"SP","Tupi Paulista","SP - Tupi Paulista",{"v":3555109,"d":"35.55.1.09"}]
[null,"SP","Turiúba","SP - Turiúba",{"v":3555208,"d":"35.55.2.08"}]
[null,"SP","Turmalina","SP - Turmalina",{"v":3555307,"d":"35.55.3.07"}]
[null,"SP","Ubarana","SP - Ubarana",{"v":3555356,"d":"35.55.3.56"}]
[null,"SP","Ubatuba","SP - Ubatuba",{"v":3555406,"d":"35.55.4.06"}]
[null,"SP","Ubirajara","SP - Ubirajara",{"v":3555505,"d":"35.55.5.05"}]
[null,"SP","Uchoa","SP - Uchoa",{"v":3555604,"d":"35.55.6.04"}]
[null,"SP","União Paulista","SP - União Paulista",{"v":3555703,"d":"35.55.7.03"}]
[null,"SP","Urânia","SP - Urânia",{"v":3555802,"d":"35.55.8.02"}]
[null,"SP","Uru","SP - Uru",{"v":3555901,"d":"35.55.9.01"}]
[null,"SP","Urupês","SP - Urupês",{"v":3556008,"d":"35.56.0.08"}]
[null,"SP","Valentim Gentil","SP - Valentim Gentil",{"v":3556107,"d":"35.56.1.07"}]
[null,"SP","Valinhos","SP - Valinhos",{"v":3556206,"d":"35.56.2.06"}]
[null,"SP","Valparaíso","SP - Valparaíso",{"v":3556305,"d":"35.56.3.05"}]
[null,"SP","Vargem","SP - Vargem",{"v":3556354,"d":"35.56.3.54"}]
[null,"SP","Vargem Grande do Sul","SP - Vargem Grande do Sul",{"v":3556404,"d":"35.56.4.04"}]
[null,"SP","Vargem Grande Paulista","SP - Vargem Grande Paulista",{"v":3556453,"d":"35.56.4.53"}]
[null,"SP","Várzea Paulista","SP - Várzea Paulista",{"v":3556503,"d":"35.56.5.03"}]
[null,"SP","Vera Cruz","SP - Vera Cruz",{"v":3556602,"d":"35.56.6.02"}]
[null,"SP","Vinhedo","SP - Vinhedo",{"v":3556701,"d":"35.56.7.01"}]
[null,"SP","Viradouro","SP - Viradouro",{"v":3556800,"d":"35.56.8.00"}]
[null,"SP","Vista Alegre do Alto","SP - Vista Alegre do Alto",{"v":3556909,"d":"35.56.9.09"}]
[null,"SP","Vitória Brasil","SP - Vitória Brasil",{"v":3556958,"d":"35.56.9.58"}]
[null,"SP","Votorantim","SP - Votorantim",{"v":3557006,"d":"35.57.0.06"}]
[null,"SP","Votuporanga","SP - Votuporanga",{"v":3557105,"d":"35.57.1.05"}]
[null,"SP","Zacarias","SP - Zacarias",{"v":3557154,"d":"35.57.1.54"}]
[null,"TO","Abreulândia","TO - Abreulândia",{"v":1700251,"d":"17.00.2.51"}]
[null,"TO","Aguiarnópolis","TO - Aguiarnópolis",{"v":1700301,"d":"17.00.3.01"}]
[null,"TO","Aliança do Tocantins","TO - Aliança do Tocantins",{"v":1700350,"d":"17.00.3.50"}]
[null,"TO","Almas","TO - Almas",{"v":1700400,"d":"17.00.4.00"}]
[null,"TO","Alvorada","TO - Alvorada",{"v":1700707,"d":"17.00.7.07"}]
[null,"TO","Ananás","TO - Ananás",{"v":1701002,"d":"17.01.0.02"}]
[null,"TO","Angico","TO - Angico",{"v":1701051,"d":"17.01.0.51"}]
[null,"TO","Aparecida do Rio Negro","TO - Aparecida do Rio Negro",{"v":1701101,"d":"17.01.1.01"}]
[null,"TO","Aragominas","TO - Aragominas",{"v":1701309,"d":"17.01.3.09"}]
[null,"TO","Araguacema","TO - Araguacema",{"v":1701903,"d":"17.01.9.03"}]
[null,"TO","Araguaçu",{"$f":"CONCATENATE(B5471,\" - \",C5471)","v":"TO - Araguaçu"},{"v":1702000,"d":"17.02.0.00"}]
[null,"TO","Araguaína","TO - Araguaína",{"v":1702109,"d":"17.02.1.09"}]
[null,"TO","Araguanã","TO - Araguanã",{"v":1702158,"d":"17.02.1.58"}]
[null,"TO","Araguatins","TO - Araguatins",{"v":1702208,"d":"17.02.2.08"}]
[null,"TO","Arapoema","TO - Arapoema",{"v":1702307,"d":"17.02.3.07"}]
[null,"TO","Arraias","TO - Arraias",{"v":1702406,"d":"17.02.4.06"}]
[null,"TO","Augustinópolis","TO - Augustinópolis",{"v":1702554,"d":"17.02.5.54"}]
[null,"TO","Aurora do Tocantins","TO - Aurora do Tocantins",{"v":1702703,"d":"17.02.7.03"}]
[null,"TO","Axixá do Tocantins","TO - Axixá do Tocantins",{"v":1702901,"d":"17.02.9.01"}]
[null,"TO","Babaçulândia","TO - Babaçulândia",{"v":1703008,"d":"17.03.0.08"}]
[null,"TO","Bandeirantes do Tocantins","TO - Bandeirantes do Tocantins",{"v":1703057,"d":"17.03.0.57"}]
[null,"TO","Barra do Ouro","TO - Barra do Ouro",{"v":1703073,"d":"17.03.0.73"}]
[null,"TO","Barrolândia","TO - Barrolândia",{"v":1703107,"d":"17.03.1.07"}]
[null,"TO","Bernardo Sayão","TO - Bernardo Sayão",{"v":1703206,"d":"17.03.2.06"}]
[null,"TO","Bom Jesus do Tocantins","TO - Bom Jesus do Tocantins",{"v":1703305,"d":"17.03.3.05"}]
[null,"TO","Brasilândia do Tocantins","TO - Brasilândia do Tocantins",{"v":1703602,"d":"17.03.6.02"}]
[null,"TO","Brejinho de Nazaré","TO - Brejinho de Nazaré",{"v":1703701,"d":"17.03.7.01"}]
[null,"TO","Buriti do Tocantins","TO - Buriti do Tocantins",{"v":1703800,"d":"17.03.8.00"}]
[null,"TO","Cachoeirinha","TO - Cachoeirinha",{"v":1703826,"d":"17.03.8.26"}]
[null,"TO","Campos Lindos","TO - Campos Lindos",{"v":1703842,"d":"17.03.8.42"}]
[null,"TO","Cariri do Tocantins","TO - Cariri do Tocantins",{"v":1703867,"d":"17.03.8.67"}]
[null,"TO","Carmolândia","TO - Carmolândia",{"v":1703883,"d":"17.03.8.83"}]
[null,"TO","Carrasco Bonito","TO - Carrasco Bonito",{"v":1703891,"d":"17.03.8.91"}]
[null,"TO","Caseara","TO - Caseara",{"v":1703909,"d":"17.03.9.09"}]
[null,"TO","Centenário","TO - Centenário",{"v":1704105,"d":"17.04.1.05"}]
[null,"TO","Chapada da Natividade","TO - Chapada da Natividade",{"v":1705102,"d":"17.05.1.02"}]
[null,"TO","Chapada de Areia","TO - Chapada de Areia",{"v":1704600,"d":"17.04.6.00"}]
[null,"TO","Colinas do Tocantins","TO - Colinas do Tocantins",{"v":1705508,"d":"17.05.5.08"}]
[null,"TO","Colméia","TO - Colméia",{"v":1716703,"d":"17.16.7.03"}]
[null,"TO","Combinado","TO - Combinado",{"v":1705557,"d":"17.05.5.57"}]
[null,"TO","Conceição do Tocantins","TO - Conceição do Tocantins",{"v":1705607,"d":"17.05.6.07"}]
[null,"TO","Couto Magalhães","TO - Couto Magalhães",{"v":1706001,"d":"17.06.0.01"}]
[null,"TO","Cristalândia","TO - Cristalândia",{"v":1706100,"d":"17.06.1.00"}]
[null,"TO","Crixás do Tocantins","TO - Crixás do Tocantins",{"v":1706258,"d":"17.06.2.58"}]
[null,"TO","Darcinópolis","TO - Darcinópolis",{"v":1706506,"d":"17.06.5.06"}]
[null,"TO","Dianópolis","TO - Dianópolis",{"v":1707009,"d":"17.07.0.09"}]
[null,"TO","Divinópolis do Tocantins","TO - Divinópolis do Tocantins",{"v":1707108,"d":"17.07.1.08"}]
[null,"TO","Dois Irmãos do Tocantins","TO - Dois Irmãos do Tocantins",{"v":1707207,"d":"17.07.2.07"}]
[null,"TO","Dueré","TO - Dueré",{"v":1707306,"d":"17.07.3.06"}]
[null,"TO","Esperantina","TO - Esperantina",{"v":1707405,"d":"17.07.4.05"}]
[null,"TO","Fátima","TO - Fátima",{"v":1707553,"d":"17.07.5.53"}]
[null,"TO","Figueirópolis","TO - Figueirópolis",{"v":1707652,"d":"17.07.6.52"}]
[null,"TO","Filadélfia","TO - Filadélfia",{"v":1707702,"d":"17.07.7.02"}]
[null,"TO","Formoso do Araguaia","TO - Formoso do Araguaia",{"v":1708205,"d":"17.08.2.05"}]
[null,"TO","Fortaleza do Tabocão","TO - Fortaleza do Tabocão",{"v":1708254,"d":"17.08.2.54"}]
[null,"TO","Goianorte","TO - Goianorte",{"v":1708304,"d":"17.08.3.04"}]
[null,"TO","Goiatins","TO - Goiatins",{"v":1709005,"d":"17.09.0.05"}]
[null,"TO","Guaraí","TO - Guaraí",{"v":1709302,"d":"17.09.3.02"}]
[null,"TO","Gurupi","TO - Gurupi",{"v":1709500,"d":"17.09.5.00"}]
[null,"TO","Ipueiras","TO - Ipueiras",{"v":1709807,"d":"17.09.8.07"}]
[null,"TO","Itacajá","TO - Itacajá",{"v":1710508,"d":"17.10.5.08"}]
[null,"TO","Itaguatins","TO - Itaguatins",{"v":1710706,"d":"17.10.7.06"}]
[null,"TO","Itapiratins","TO - Itapiratins",{"v":1710904,"d":"17.10.9.04"}]
[null,"TO","Itaporã do Tocantins","TO - Itaporã do Tocantins",{"v":1711100,"d":"17.11.1.00"}]
[null,"TO","Jaú do Tocantins","TO - Jaú do Tocantins",{"v":1711506,"d":"17.11.5.06"}]
[null,"TO","Juarina","TO - Juarina",{"v":1711803,"d":"17.11.8.03"}]
[null,"TO","Lagoa da Confusão","TO - Lagoa da Confusão",{"v":1711902,"d":"17.11.9.02"}]
[null,"TO","Lagoa do Tocantins","TO - Lagoa do Tocantins",{"v":1711951,"d":"17.11.9.51"}]
[null,"TO","Lajeado","TO - Lajeado",{"v":1712009,"d":"17.12.0.09"}]
[null,"TO","Lavandeira","TO - Lavandeira",{"v":1712157,"d":"17.12.1.57"}]
[null,"TO","Lizarda","TO - Lizarda",{"v":1712405,"d":"17.12.4.05"}]
[null,"TO","Luzinópolis","TO - Luzinópolis",{"v":1712454,"d":"17.12.4.54"}]
[null,"TO","Marianópolis do Tocantins","TO - Marianópolis do Tocantins",{"v":1712504,"d":"17.12.5.04"}]
[null,"TO","Mateiros","TO - Mateiros",{"v":1712702,"d":"17.12.7.02"}]
[null,"TO","Maurilândia do Tocantins",{"$f":"CONCATENATE(B5535,\" - \",C5535)","v":"TO - Maurilândia do Tocantins"},{"v":1712801,"d":"17.12.8.01"}]
[null,"TO","Miracema do Tocantins","TO - Miracema do Tocantins",{"v":1713205,"d":"17.13.2.05"}]
[null,"TO","Miranorte","TO - Miranorte",{"v":1713304,"d":"17.13.3.04"}]
[null,"TO","Monte do Carmo","TO - Monte do Carmo",{"v":1713601,"d":"17.13.6.01"}]
[null,"TO","Monte Santo do Tocantins","TO - Monte Santo do Tocantins",{"v":1713700,"d":"17.13.7.00"}]
[null,"TO","Muricilândia","TO - Muricilândia",{"v":1713957,"d":"17.13.9.57"}]
[null,"TO","Natividade","TO - Natividade",{"v":1714203,"d":"17.14.2.03"}]
[null,"TO","Nazaré","TO - Nazaré",{"v":1714302,"d":"17.14.3.02"}]
[null,"TO","Nova Olinda","TO - Nova Olinda",{"v":1714880,"d":"17.14.8.80"}]
[null,"TO","Nova Rosalândia","TO - Nova Rosalândia",{"v":1715002,"d":"17.15.0.02"}]
[null,"TO","Novo Acordo","TO - Novo Acordo",{"v":1715101,"d":"17.15.1.01"}]
[null,"TO","Novo Alegre","TO - Novo Alegre",{"v":1715150,"d":"17.15.1.50"}]
[null,"TO","Novo Jardim","TO - Novo Jardim",{"v":1715259,"d":"17.15.2.59"}]
[null,"TO","Oliveira de Fátima","TO - Oliveira de Fátima",{"v":1715507,"d":"17.15.5.07"}]
[null,"TO","Palmas","TO - Palmas",{"v":1721000,"d":"17.21.0.00"}]
[null,"TO","Palmeirante","TO - Palmeirante",{"v":1715705,"d":"17.15.7.05"}]
[null,"TO","Palmeiras do Tocantins","TO - Palmeiras do Tocantins",{"v":1713809,"d":"17.13.8.09"}]
[null,"TO","Palmeirópolis","TO - Palmeirópolis",{"v":1715754,"d":"17.15.7.54"}]
[null,"TO","Paraíso do Tocantins","TO - Paraíso do Tocantins",{"v":1716109,"d":"17.16.1.09"}]
[null,"TO","Paranã","TO - Paranã",{"v":1716208,"d":"17.16.2.08"}]
[null,"TO","Pau D'Arco","TO - Pau D'Arco",{"v":1716307,"d":"17.16.3.07"}]
[null,"TO","Pedro Afonso","TO - Pedro Afonso",{"v":1716505,"d":"17.16.5.05"}]
[null,"TO","Peixe","TO - Peixe",{"v":1716604,"d":"17.16.6.04"}]
[null,"TO","Pequizeiro","TO - Pequizeiro",{"v":1716653,"d":"17.16.6.53"}]
[null,"TO","Pindorama do Tocantins","TO - Pindorama do Tocantins",{"v":1717008,"d":"17.17.0.08"}]
[null,"TO","Piraquê","TO - Piraquê",{"v":1717206,"d":"17.17.2.06"}]
[null,"TO","Pium","TO - Pium",{"v":1717503,"d":"17.17.5.03"}]
[null,"TO","Ponte Alta do Bom Jesus","TO - Ponte Alta do Bom Jesus",{"v":1717800,"d":"17.17.8.00"}]
[null,"TO","Ponte Alta do Tocantins","TO - Ponte Alta do Tocantins",{"v":1717909,"d":"17.17.9.09"}]
[null,"TO","Porto Alegre do Tocantins","TO - Porto Alegre do Tocantins",{"v":1718006,"d":"17.18.0.06"}]
[null,"TO","Porto Nacional","TO - Porto Nacional",{"v":1718204,"d":"17.18.2.04"}]
[null,"TO","Praia Norte","TO - Praia Norte",{"v":1718303,"d":"17.18.3.03"}]
[null,"TO","Presidente Kennedy","TO - Presidente Kennedy",{"v":1718402,"d":"17.18.4.02"}]
[null,"TO","Pugmil","TO - Pugmil",{"v":1718451,"d":"17.18.4.51"}]
[null,"TO","Recursolândia","TO - Recursolândia",{"v":1718501,"d":"17.18.5.01"}]
[null,"TO","Riachinho","TO - Riachinho",{"v":1718550,"d":"17.18.5.50"}]
[null,"TO","Rio da Conceição","TO - Rio da Conceição",{"v":1718659,"d":"17.18.6.59"}]
[null,"TO","Rio dos Bois","TO - Rio dos Bois",{"v":1718709,"d":"17.18.7.09"}]
[null,"TO","Rio Sono","TO - Rio Sono",{"v":1718758,"d":"17.18.7.58"}]
[null,"TO","Sampaio","TO - Sampaio",{"v":1718808,"d":"17.18.8.08"}]
[null,"TO","Sandolândia","TO - Sandolândia",{"v":1718840,"d":"17.18.8.40"}]
[null,"TO","Santa Fé do Araguaia","TO - Santa Fé do Araguaia",{"v":1718865,"d":"17.18.8.65"}]
[null,"TO","Santa Maria do Tocantins","TO - Santa Maria do Tocantins",{"v":1718881,"d":"17.18.8.81"}]
[null,"TO","Santa Rita do Tocantins","TO - Santa Rita do Tocantins",{"v":1718899,"d":"17.18.8.99"}]
[null,"TO","Santa Rosa do Tocantins","TO - Santa Rosa do Tocantins",{"v":1718907,"d":"17.18.9.07"}]
[null,"TO","Santa Tereza do Tocantins","TO - Santa Tereza do Tocantins",{"v":1719004,"d":"17.19.0.04"}]
[null,"TO","Santa Terezinha do Tocantins","TO - Santa Terezinha do Tocantins",{"v":1720002,"d":"17.20.0.02"}]
[null,"TO","São Bento do Tocantins","TO - São Bento do Tocantins",{"v":1720101,"d":"17.20.1.01"}]
[null,"TO","São Félix do Tocantins","TO - São Félix do Tocantins",{"v":1720150,"d":"17.20.1.50"}]
[null,"TO","São Miguel do Tocantins","TO - São Miguel do Tocantins",{"v":1720200,"d":"17.20.2.00"}]
[null,"TO","São Salvador do Tocantins","TO - São Salvador do Tocantins",{"v":1720259,"d":"17.20.2.59"}]
[null,"TO","São Sebastião do Tocantins","TO - São Sebastião do Tocantins",{"v":1720309,"d":"17.20.3.09"}]
[null,"TO","São Valério","TO - São Valério",{"v":1720499,"d":"17.20.4.99"}]
[null,"TO","Silvanópolis","TO - Silvanópolis",{"v":1720655,"d":"17.20.6.55"}]
[null,"TO","Sítio Novo do Tocantins","TO - Sítio Novo do Tocantins",{"v":1720804,"d":"17.20.8.04"}]
[null,"TO","Sucupira","TO - Sucupira",{"v":1720853,"d":"17.20.8.53"}]
[null,"TO","Taguatinga","TO - Taguatinga",{"v":1720903,"d":"17.20.9.03"}]
[null,"TO","Taipas do Tocantins","TO - Taipas do Tocantins",{"v":1720937,"d":"17.20.9.37"}]
[null,"TO","Talismã","TO - Talismã",{"v":1720978,"d":"17.20.9.78"}]
[null,"TO","Tocantínia","TO - Tocantínia",{"v":1721109,"d":"17.21.1.09"}]
[null,"TO","Tocantinópolis","TO - Tocantinópolis",{"v":1721208,"d":"17.21.2.08"}]
[null,"TO","Tupirama","TO - Tupirama",{"v":1721257,"d":"17.21.2.57"}]
[null,"TO","Tupiratins","TO - Tupiratins",{"v":1721307,"d":"17.21.3.07"}]
[null,"TO","Wanderlândia","TO - Wanderlândia",{"v":1722081,"d":"17.22.0.81"}]
[null,"TO","Xambioá",{"$f":"CONCATENATE(B5599,\" - \",C5599)","v":"TO - Xambioá"},{"v":1722107,"d":"17.22.1.07"}]